id_mutation,date_mutation,numero_disposition,nature_mutation,valeur_fonciere,adresse_numero,adresse_suffixe,adresse_nom_voie,adresse_code_voie,code_postal,code_commune,nom_commune,code_departement,ancien_code_commune,ancien_nom_commune,id_parcelle,ancien_id_parcelle,numero_volume,lot1_numero,lot1_surface_carrez,lot2_numero,lot2_surface_carrez,lot3_numero,lot3_surface_carrez,lot4_numero,lot4_surface_carrez,lot5_numero,lot5_surface_carrez,nombre_lots,code_type_local,type_local,surface_reelle_bati,nombre_pieces_principales,code_nature_culture,nature_culture,code_nature_culture_speciale,nature_culture_speciale,surface_terrain,longitude,latitude
2021-913308,2021-01-18,000001,Vente,155000,3,,RUE DE LA HALLE,0032,55800,55378,Nettancourt,55,,,55378000AH0095,,,,,,,,,,,,,0,1,Maison,54,2,S,sols,,,328,4.942404,48.874049
2021-913308,2021-01-18,000001,Vente,155000,2,,RUE DE L EGLISE,0020,55800,55378,Nettancourt,55,,,55378000AH0096,,,,,,,,,,,,,0,3,Dépendance,,0,S,sols,,,921,4.94229,48.873888
2021-913308,2021-01-18,000001,Vente,155000,2,,RUE DE L EGLISE,0020,55800,55378,Nettancourt,55,,,55378000AH0096,,,,,,,,,,,,,0,1,Maison,200,5,J,jardins,POTAG,Jardin potager,600,4.94229,48.873888
2021-913308,2021-01-18,000001,Vente,155000,2,,RUE DE L EGLISE,0020,55800,55378,Nettancourt,55,,,55378000AH0096,,,,,,,,,,,,,0,3,Dépendance,,0,J,jardins,POTAG,Jardin potager,600,4.94229,48.873888
2021-913308,2021-01-18,000001,Vente,155000,2,,RUE DE L EGLISE,0020,55800,55378,Nettancourt,55,,,55378000AH0096,,,,,,,,,,,,,0,3,Dépendance,,0,J,jardins,POTAG,Jardin potager,600,4.94229,48.873888
2021-913308,2021-01-18,000001,Vente,155000,2,,RUE DE L EGLISE,0020,55800,55378,Nettancourt,55,,,55378000AH0096,,,,,,,,,,,,,0,1,Maison,200,5,S,sols,,,921,4.94229,48.873888
2021-913308,2021-01-18,000001,Vente,155000,2,,RUE DE L EGLISE,0020,55800,55378,Nettancourt,55,,,55378000AH0096,,,,,,,,,,,,,0,3,Dépendance,,0,S,sols,,,921,4.94229,48.873888
2021-914873,2021-05-12,000001,Vente,119800,12,,RUE DE LA HALLE,0032,55800,55378,Nettancourt,55,,,55378000AE0044,,,,,,,,,,,,,0,1,Maison,94,4,S,sols,,,500,4.942988,48.875068
2021-914873,2021-05-12,000001,Vente,119800,12,,RUE DE LA HALLE,0032,55800,55378,Nettancourt,55,,,55378000AE0044,,,,,,,,,,,,,0,1,Maison,94,4,J,jardins,POTAG,Jardin potager,448,4.942988,48.875068
2021-915030,2021-05-17,000001,Vente,130000,11,,RUE DE LA HALLE,0032,55800,55378,Nettancourt,55,,,55378000AH0090,,,,,,,,,,,,,0,1,Maison,153,6,S,sols,,,1160,4.942238,48.874854
2021-915030,2021-05-17,000001,Vente,130000,,,LE VILLAGE OUEST,B146,55800,55378,Nettancourt,55,,,55378000AH0441,,,,,,,,,,,,,0,,,,,J,jardins,POTAG,Jardin potager,521,4.941635,48.874941
2021-915490,2021-06-28,000001,Vente,875,,,LA COTE LESSUE,B040,55800,55378,Nettancourt,55,,,55378000ZK0025,,,,,,,,,,,,,0,,,,,S,sols,,,175,4.940257,48.875815
2021-915522,2021-06-28,000001,Vente,110000,7,,RUE DE LA GARE,0028,55800,55378,Nettancourt,55,,,55378000AE0092,,,,,,,,,,,,,0,1,Maison,110,6,S,sols,,,824,4.943326,48.880017
2021-917649,2021-11-20,000001,Vente,135000,11,,RUE DU MOULIN,0045,55800,55378,Nettancourt,55,,,55378000AH0194,,,,,,,,,,,,,0,3,Dépendance,,0,J,jardins,POTAG,Jardin potager,4144,4.943878,48.871748
2021-917649,2021-11-20,000001,Vente,135000,11,,RUE DU MOULIN,0045,55800,55378,Nettancourt,55,,,55378000AH0194,,,,,,,,,,,,,0,1,Maison,100,3,J,jardins,POTAG,Jardin potager,4144,4.943878,48.871748
2021-917649,2021-11-20,000001,Vente,135000,11,,RUE DU MOULIN,0045,55800,55378,Nettancourt,55,,,55378000AH0194,,,,,,,,,,,,,0,3,Dépendance,,0,S,sols,,,752,4.943878,48.871748
2021-917649,2021-11-20,000001,Vente,135000,11,,RUE DU MOULIN,0045,55800,55378,Nettancourt,55,,,55378000AH0194,,,,,,,,,,,,,0,1,Maison,100,3,S,sols,,,752,4.943878,48.871748
2021-917649,2021-11-20,000001,Vente,135000,,,LE BOURBIER,B009,55800,55378,Nettancourt,55,,,55378000AH0195,,,,,,,,,,,,,0,,,,,L,landes,FRICH,Friche,80,4.944862,48.871703
2021-917649,2021-11-20,000001,Vente,135000,,,LE BOURBIER,B009,55800,55378,Nettancourt,55,,,55378000AH0196,,,,,,,,,,,,,0,,,,,L,landes,FRICH,Friche,68,4.944864,48.871469
2021-917649,2021-11-20,000001,Vente,135000,,,LE BOURBIER,B009,55800,55378,Nettancourt,55,,,55378000AH0197,,,,,,,,,,,,,0,,,,,L,landes,FRICH,Friche,33,4.94489,48.871425
2021-917768,2021-12-01,000001,Vente,1200,,,LA COTE JEANNOT,B039,55800,55378,Nettancourt,55,,,55378000AS0088,,,,,,,,,,,,,0,,,,,B,bois,,,226,4.926951,48.868738
2021-917768,2021-12-01,000001,Vente,1200,,,LA COTE JEANNOT,B039,55800,55378,Nettancourt,55,,,55378000AS0088,,,,,,,,,,,,,0,,,,,BS,taillis sous futaie,,,679,4.926951,48.868738
2021-917768,2021-12-01,000001,Vente,1200,,,LA COTE JEANNOT,B039,55800,55378,Nettancourt,55,,,55378000AS0094,,,,,,,,,,,,,0,,,,,B,bois,,,90,4.926601,48.868553
2021-917768,2021-12-01,000001,Vente,1200,,,LA COTE JEANNOT,B039,55800,55378,Nettancourt,55,,,55378000AS0094,,,,,,,,,,,,,0,,,,,BS,taillis sous futaie,,,272,4.926601,48.868553
2021-918191,2021-12-22,000001,Vente,27000,7,,RUE DES JUIFS,0035,55800,55378,Nettancourt,55,,,55378000AH0136,,,,,,,,,,,,,0,1,Maison,120,6,S,sols,,,818,4.940808,48.872741
