id_mutation,date_mutation,numero_disposition,nature_mutation,valeur_fonciere,adresse_numero,adresse_suffixe,adresse_nom_voie,adresse_code_voie,code_postal,code_commune,nom_commune,code_departement,ancien_code_commune,ancien_nom_commune,id_parcelle,ancien_id_parcelle,numero_volume,lot1_numero,lot1_surface_carrez,lot2_numero,lot2_surface_carrez,lot3_numero,lot3_surface_carrez,lot4_numero,lot4_surface_carrez,lot5_numero,lot5_surface_carrez,nombre_lots,code_type_local,type_local,surface_reelle_bati,nombre_pieces_principales,code_nature_culture,nature_culture,code_nature_culture_speciale,nature_culture_speciale,surface_terrain,longitude,latitude
2021-914108,2021-03-22,000001,Vente,117000,7,,RUE DE L EGLISE,0025,55110,55471,Saulmory-Villefranche,55,,,55471000AV0049,,,,,,,,,,,,,0,1,Maison,113,6,S,sols,,,330,5.178864,49.435399
2021-914108,2021-03-22,000001,Vente,117000,,,LE VILLAGE DE SAULMORY,B056,55110,55471,Saulmory-Villefranche,55,,,55471000AV0090,,,,,,,,,,,,,0,,,,,S,sols,,,490,5.17885,49.435592
2021-914732,2021-05-07,000001,Vente,7000,,,LE GRAND PAQUIS,B021,55110,55471,Saulmory-Villefranche,55,,,55471000ZE0024,,,,,,,,,,,,,0,,,,,P,prés,,,5516,5.186895,49.430142
2021-914732,2021-05-07,000001,Vente,7000,,,LE GRAND PAQUIS,B021,55110,55471,Saulmory-Villefranche,55,,,55471000ZE0024,,,,,,,,,,,,,0,,,,,P,prés,,,8274,5.186895,49.430142
2021-915284,2021-06-17,000001,Vente,4000,1,,RUE DE L EGLISE,0025,55110,55471,Saulmory-Villefranche,55,,,55471000AV0044,,,,,,,,,,,,,0,1,Maison,38,2,S,sols,,,365,5.177379,49.434979
2021-915861,2021-07-19,000001,Vente,27102,,,DANRULE,B015,55110,55471,Saulmory-Villefranche,55,,,55471000ZH0024,,,,,,,,,,,,,0,,,,,P,prés,,,34107,5.165302,49.423404
2021-915861,2021-07-19,000001,Vente,27102,,,DANRULE,B015,55110,55471,Saulmory-Villefranche,55,,,55471000ZH0024,,,,,,,,,,,,,0,,,,,P,prés,,,17053,5.165302,49.423404
2021-915861,2021-07-19,000001,Vente,27102,,,A GUERIN,B022,55110,55471,Saulmory-Villefranche,55,,,55471000ZH0045,,,,,,,,,,,,,0,,,,,BT,taillis simples,,,1225,5.163726,49.422693
2021-917901,2021-11-02,000001,Vente,108709,,,DANRULE,B015,55110,55471,Saulmory-Villefranche,55,,,55471000ZH0023,,,,,,,,,,,,,0,,,,,T,terres,,,6480,5.163529,49.42398
