id_mutation,date_mutation,numero_disposition,nature_mutation,valeur_fonciere,adresse_numero,adresse_suffixe,adresse_nom_voie,adresse_code_voie,code_postal,code_commune,nom_commune,code_departement,ancien_code_commune,ancien_nom_commune,id_parcelle,ancien_id_parcelle,numero_volume,lot1_numero,lot1_surface_carrez,lot2_numero,lot2_surface_carrez,lot3_numero,lot3_surface_carrez,lot4_numero,lot4_surface_carrez,lot5_numero,lot5_surface_carrez,nombre_lots,code_type_local,type_local,surface_reelle_bati,nombre_pieces_principales,code_nature_culture,nature_culture,code_nature_culture_speciale,nature_culture_speciale,surface_terrain,longitude,latitude
2021-913448,2021-01-29,000001,Vente,168400,37,,RUE DU MONT,0030,55260,55570,Villotte-sur-Aire,55,,,55570000AA0110,,,,,,,,,,,,,0,1,Maison,131,6,P,prés,,,1365,5.342904,48.859639
2021-913448,2021-01-29,000001,Vente,168400,37,,RUE DU MONT,0030,55260,55570,Villotte-sur-Aire,55,,,55570000AA0110,,,,,,,,,,,,,0,1,Maison,131,6,S,sols,,,510,5.342904,48.859639
2021-914546,2021-05-10,000002,Vente,9850,,,LE VILLAGE,B479,55260,55570,Villotte-sur-Aire,55,,,55570000AA0259,,,,,,,,,,,,,0,,,,,S,sols,,,1805,5.344976,48.85907
2021-915812,2021-07-26,000001,Vente,500,,,CHATILLON,B523,55260,55570,Villotte-sur-Aire,55,,,55570000ZI0080,,,,,,,,,,,,,0,,,,,P,prés,,,252,5.344832,48.857676
2021-916142,2021-08-25,000002,Vente,1,,,RUELLE DES MAYES,B408,55260,55570,Villotte-sur-Aire,55,,,55570000AA0261,,,,,,,,,,,,,0,,,,,S,sols,,,209,5.340332,48.860201
2021-916150,2021-08-26,000001,Vente,164500,1,,RLE DES MAYES,0029,55260,55570,Villotte-sur-Aire,55,,,55570000AA0023,,,,,,,,,,,,,0,1,Maison,103,6,S,sols,,,594,5.340148,48.860332
2021-916150,2021-08-26,000001,Vente,164500,1,,RLE DES MAYES,0029,55260,55570,Villotte-sur-Aire,55,,,55570000AA0023,,,,,,,,,,,,,0,1,Maison,103,6,VE,vergers,,,1324,5.340148,48.860332
2021-916150,2021-08-26,000001,Vente,164500,,,RUELLE DES MAYES,B408,55260,55570,Villotte-sur-Aire,55,,,55570000AA0261,,,,,,,,,,,,,0,,,,,S,sols,,,209,5.340332,48.860201
2021-916995,2021-10-21,000001,Vente,4500,,,AU VAUX,B456,55260,55570,Villotte-sur-Aire,55,,,55570000ZI0002,,,,,,,,,,,,,0,,,,,VE,vergers,,,940,5.344659,48.856879
