id_mutation,date_mutation,numero_disposition,nature_mutation,valeur_fonciere,adresse_numero,adresse_suffixe,adresse_nom_voie,adresse_code_voie,code_postal,code_commune,nom_commune,code_departement,ancien_code_commune,ancien_nom_commune,id_parcelle,ancien_id_parcelle,numero_volume,lot1_numero,lot1_surface_carrez,lot2_numero,lot2_surface_carrez,lot3_numero,lot3_surface_carrez,lot4_numero,lot4_surface_carrez,lot5_numero,lot5_surface_carrez,nombre_lots,code_type_local,type_local,surface_reelle_bati,nombre_pieces_principales,code_nature_culture,nature_culture,code_nature_culture_speciale,nature_culture_speciale,surface_terrain,longitude,latitude
2021-946165,2021-02-20,000001,Vente,25000,116,,RTE BUISSONNIERE,0045,58500,58011,Armes,58,,,580110000A0677,,,,,,,,,,,,,0,1,Maison,52,3,S,sols,,,60,3.548983,47.457512
2021-947124,2021-04-21,000001,Vente,48000,129,,RTE BUISSONNIERE,0045,58500,58011,Armes,58,,,580110000A1251,,,,,,,,,,,,,0,1,Maison,114,7,S,sols,,,200,3.548765,47.457991
2021-947480,2021-05-12,000001,Vente,20000,84,,RTE BUISSONNIERE,0045,58500,58011,Armes,58,,,580110000A0723,,,,,,,,,,,,,0,1,Maison,106,5,S,sols,,,68,3.546473,47.45876
2021-947480,2021-05-12,000001,Vente,20000,84,,RTE BUISSONNIERE,0045,58500,58011,Armes,58,,,580110000A0723,,,,,,,,,,,,,0,3,Dépendance,,0,S,sols,,,68,3.546473,47.45876
2021-947480,2021-05-12,000001,Vente,20000,,,LE BOURG,B009,58500,58011,Armes,58,,,580110000A0729,,,,,,,,,,,,,0,,,,,J,jardins,,,415,3.546199,47.458425
2021-947480,2021-05-12,000001,Vente,20000,,,LE BOURG,B009,58500,58011,Armes,58,,,580110000A0963,,,,,,,,,,,,,0,,,,,S,sols,,,24,3.546656,47.458689
2021-947781,2021-05-25,000001,Vente,45500,189,,LES COUTAS BRULES,B026,58500,58011,Armes,58,,,580110000A1199,,,,,,,,,,,,,0,1,Maison,82,5,S,sols,,,864,3.53644,47.458164
2021-949304,2021-07-31,000001,Vente,62500,526,,LE BOURG,B009,58500,58011,Armes,58,,,580110000A0627,,,,,,,,,,,,,0,1,Maison,88,3,S,sols,,,120,3.549232,47.458537
2021-949304,2021-07-31,000001,Vente,62500,526,,LE BOURG,B009,58500,58011,Armes,58,,,580110000A0627,,,,,,,,,,,,,0,1,Maison,88,3,T,terres,,,240,3.549232,47.458537
2021-949304,2021-07-31,000001,Vente,62500,526,,LE BOURG,B009,58500,58011,Armes,58,,,580110000A0627,,,,,,,,,,,,,0,1,Maison,88,3,T,terres,,,240,3.549232,47.458537
2021-949304,2021-07-31,000001,Vente,62500,,,LE BOURG,B009,58500,58011,Armes,58,,,580110000A0628,,,,,,,,,,,,,0,,,,,T,terres,,,335,3.549281,47.458424
2021-949304,2021-07-31,000001,Vente,62500,,,LE BOURG,B009,58500,58011,Armes,58,,,580110000A0628,,,,,,,,,,,,,0,,,,,S,sols,,,150,3.549281,47.458424
2021-949304,2021-07-31,000001,Vente,62500,,,LE BOURG,B009,58500,58011,Armes,58,,,580110000A0628,,,,,,,,,,,,,0,,,,,T,terres,,,335,3.549281,47.458424
2021-949304,2021-07-31,000001,Vente,62500,131,,RTE BUISSONNIERE,0045,58500,58011,Armes,58,,,580110000A0974,,,,,,,,,,,,,0,,,,,S,sols,,,390,3.548887,47.45794
2021-949304,2021-07-31,000001,Vente,62500,,,RTE BUISSONNIERE,0045,58500,58011,Armes,58,,,580110000A1252,,,,,,,,,,,,,0,,,,,S,sols,,,211,3.549013,47.458053
2021-949854,2021-09-01,000001,Vente,64500,112,B,RTE BUISSONNIERE,0045,58500,58011,Armes,58,,,580110000A1170,,,,,,,,,,,,,0,1,Maison,112,4,S,sols,,,305,3.548691,47.457589
2021-950176,2021-10-02,000001,Vente,75000,3,,ALL PAUL NICOLAS,0177,58500,58011,Armes,58,,,580110000A1030,,,,,,,,,,,,,0,1,Maison,74,3,S,sols,,,877,3.546254,47.457429
