id_mutation,date_mutation,numero_disposition,nature_mutation,valeur_fonciere,adresse_numero,adresse_suffixe,adresse_nom_voie,adresse_code_voie,code_postal,code_commune,nom_commune,code_departement,ancien_code_commune,ancien_nom_commune,id_parcelle,ancien_id_parcelle,numero_volume,lot1_numero,lot1_surface_carrez,lot2_numero,lot2_surface_carrez,lot3_numero,lot3_surface_carrez,lot4_numero,lot4_surface_carrez,lot5_numero,lot5_surface_carrez,nombre_lots,code_type_local,type_local,surface_reelle_bati,nombre_pieces_principales,code_nature_culture,nature_culture,code_nature_culture_speciale,nature_culture_speciale,surface_terrain,longitude,latitude
2021-946044,2021-02-17,000001,Vente,75000,11,,LE BOURG,B005,58120,58099,Dommartin,58,,,580990000B0384,,,,,,,,,,,,,0,4,Local industriel. commercial ou assimilé,,0,S,sols,,,2,3.845227,47.06979
2021-946044,2021-02-17,000001,Vente,75000,11,,LE BOURG,B005,58120,58099,Dommartin,58,,,580990000B0384,,,,,,,,,,,,,0,4,Local industriel. commercial ou assimilé,,0,J,jardins,,,986,3.845227,47.06979
2021-946044,2021-02-17,000001,Vente,75000,12,,LE BOURG,B005,58120,58099,Dommartin,58,,,580990000B0385,,,,,,,,,,,,,0,1,Maison,97,4,S,sols,,,374,3.845089,47.069623
2021-946374,2021-02-23,000001,Vente,3000,,,LE GRAND CHAMP,B026,58120,58099,Dommartin,58,,,580990000A0274,,,,,,,,,,,,,0,,,,,T,terres,,,5860,3.849525,47.089028
2021-946374,2021-02-23,000001,Vente,3000,,,LE GRAND CHAMP,B026,58120,58099,Dommartin,58,,,580990000A0275,,,,,,,,,,,,,0,,,,,T,terres,,,2250,3.849203,47.089501
2021-947696,2021-05-21,000001,Vente,180000,,,LE PAVILLON,B051,58120,58099,Dommartin,58,,,580990000C0212,,,,,,,,,,,,,0,,,,,P,prés,,,19125,3.860306,47.056698
2021-947696,2021-05-21,000001,Vente,180000,108,,LE PAVILLON,B051,58120,58099,Dommartin,58,,,580990000C0213,,,,,,,,,,,,,0,1,Maison,120,3,S,sols,,,2400,3.859833,47.057697
2021-947696,2021-05-21,000001,Vente,180000,,,LE PAVILLON,B051,58120,58099,Dommartin,58,,,580990000C0214,,,,,,,,,,,,,0,,,,,J,jardins,,,1050,3.859664,47.057393
2021-947696,2021-05-21,000001,Vente,180000,,,LE PAVILLON,B051,58120,58099,Dommartin,58,,,580990000C0215,,,,,,,,,,,,,0,,,,,P,prés,,,4995,3.859521,47.057776
2021-949062,2021-07-02,000001,Vente,25000,103,,LE DOUE,B022,58120,58099,Dommartin,58,,,580990000C0065,,,,,,,,,,,,,0,1,Maison,71,2,S,sols,,,1145,3.848389,47.061723
2021-949062,2021-07-02,000001,Vente,25000,,,LE DOUE,B022,58120,58099,Dommartin,58,,,580990000C0327,,,,,,,,,,,,,0,,,,,T,terres,,,646,3.848496,47.06145
2021-949069,2021-07-02,000001,Vente,275000,,,LES CHAMPS DE BREUILLARD,B010,58120,58099,Dommartin,58,,,580990000B0082,,,,,,,,,,,,,0,,,,,BS,taillis sous futaie,,,1115,3.83838,47.068287
2021-949069,2021-07-02,000001,Vente,275000,,,LES CHAMPS DE BREUILLARD,B010,58120,58099,Dommartin,58,,,580990000B0103,,,,,,,,,,,,,0,,,,,BS,taillis sous futaie,,,14055,3.835942,47.066084
2021-949069,2021-07-02,000001,Vente,275000,,,LES CHAMPS DE L ABEILLE,B012,58120,58099,Dommartin,58,,,580990000C0032,,,,,,,,,,,,,0,,,,,BS,taillis sous futaie,,,34350,3.846137,47.058537
2021-949069,2021-07-02,000001,Vente,275000,,,LES CHAMPS DE L ABEILLE,B012,58120,58099,Dommartin,58,,,580990000C0033,,,,,,,,,,,,,0,,,,,BS,taillis sous futaie,,,5980,3.846513,47.059757
2021-949069,2021-07-02,000001,Vente,275000,104,,LE DOUE,B022,58120,58099,Dommartin,58,,,580990000C0068,,,,,,,,,,,,,0,3,Dépendance,,0,S,sols,,,390,3.849015,47.061264
2021-949069,2021-07-02,000001,Vente,275000,104,,LE DOUE,B022,58120,58099,Dommartin,58,,,580990000C0068,,,,,,,,,,,,,0,1,Maison,208,6,S,sols,,,390,3.849015,47.061264
2021-949069,2021-07-02,000001,Vente,275000,,,LE DOUE,B022,58120,58099,Dommartin,58,,,580990000C0069,,,,,,,,,,,,,0,,,,,J,jardins,,,1025,3.849283,47.061146
2021-949069,2021-07-02,000001,Vente,275000,,,LE DOUE,B022,58120,58099,Dommartin,58,,,580990000C0070,,,,,,,,,,,,,0,,,,,J,jardins,,,3530,3.848823,47.061023
2021-949069,2021-07-02,000001,Vente,275000,,,LE DOUE,B022,58120,58099,Dommartin,58,,,580990000C0071,,,,,,,,,,,,,0,,,,,S,sols,,,360,3.848501,47.061048
2021-949069,2021-07-02,000001,Vente,275000,,,LE DOUE,B022,58120,58099,Dommartin,58,,,580990000C0079,,,,,,,,,,,,,0,,,,,BS,taillis sous futaie,,,960,3.850609,47.06242
2021-949069,2021-07-02,000001,Vente,275000,,,LE DOUE,B022,58120,58099,Dommartin,58,,,580990000C0081,,,,,,,,,,,,,0,,,,,BS,taillis sous futaie,,,720,3.850313,47.061169
2021-949069,2021-07-02,000001,Vente,275000,,,LE DOUE,B022,58120,58099,Dommartin,58,,,580990000C0082,,,,,,,,,,,,,0,,,,,BS,taillis sous futaie,,,705,3.850197,47.061256
2021-949069,2021-07-02,000001,Vente,275000,,,LE DOUE,B022,58120,58099,Dommartin,58,,,580990000C0083,,,,,,,,,,,,,0,,,,,BS,taillis sous futaie,,,3220,3.84968,47.06155
2021-949069,2021-07-02,000001,Vente,275000,,,LE DOUE,B022,58120,58099,Dommartin,58,,,580990000C0084,,,,,,,,,,,,,0,,,,,S,sols,,,170,3.848925,47.061547
2021-949069,2021-07-02,000001,Vente,275000,,,LE DOUE,B022,58120,58099,Dommartin,58,,,580990000C0086,,,,,,,,,,,,,0,,,,,P,prés,,,2560,3.849318,47.061858
2021-949069,2021-07-02,000001,Vente,275000,,,LE DOUE,B022,58120,58099,Dommartin,58,,,580990000C0328,,,,,,,,,,,,,0,,,,,T,terres,,,2468,3.848527,47.062015
2021-949069,2021-07-02,000001,Vente,275000,,,LE DOUE,B022,58120,58099,Dommartin,58,,,580990000C0329,,,,,,,,,,,,,0,,,,,T,terres,,,2376,3.849807,47.061466
2021-949069,2021-07-02,000001,Vente,275000,,,LE DOUE,B022,58120,58099,Dommartin,58,,,580990000C0331,,,,,,,,,,,,,0,,,,,J,jardins,,,947,3.848996,47.06163
2021-949219,2021-07-28,000001,Vente,2000,,,LA GRANDE CHINTRE,B027,58120,58099,Dommartin,58,,,580990000C0009,,,,,,,,,,,,,0,,,,,P,prés,,,2740,3.842501,47.064503
2021-949219,2021-07-28,000001,Vente,2000,,,LA GRANDE CHINTRE,B027,58120,58099,Dommartin,58,,,580990000C0010,,,,,,,,,,,,,0,,,,,P,prés,,,9050,3.841629,47.064506
2021-951653,2021-12-16,000001,Vente,25000,113,,LE BOURG,B005,58120,58099,Dommartin,58,,,580990000B0166,,,,,,,,,,,,,0,1,Maison,77,3,S,sols,,,520,3.846703,47.0659
2021-951653,2021-12-16,000001,Vente,25000,,,LES MENOUILLES,B041,58120,58099,Dommartin,58,,,580990000B0376,,,,,,,,,,,,,0,,,,,P,prés,,,72,3.846584,47.066028
2021-951862,2021-12-23,000001,Vente,7665,,,LES CHAMPS DE COULOIRE,B011,58120,58099,Dommartin,58,,,580990000A0698,,,,,,,,,,,,,0,,,,,P,prés,,,2555,,
2021-951873,2021-12-20,000001,Vente,100000,48,,L HUY ROBIN,B037,58120,58099,Dommartin,58,,,580990000A0220,,,,,,,,,,,,,0,3,Dépendance,,0,S,sols,,,425,3.836321,47.086316
2021-951873,2021-12-20,000001,Vente,100000,48,,L HUY ROBIN,B037,58120,58099,Dommartin,58,,,580990000A0220,,,,,,,,,,,,,0,3,Dépendance,,0,S,sols,,,425,3.836321,47.086316
2021-951873,2021-12-20,000001,Vente,100000,48,,L HUY ROBIN,B037,58120,58099,Dommartin,58,,,580990000A0220,,,,,,,,,,,,,0,1,Maison,97,5,S,sols,,,425,3.836321,47.086316
2021-951873,2021-12-20,000001,Vente,100000,,,L HUY ROBIN,B037,58120,58099,Dommartin,58,,,580990000A0618,,,,,,,,,,,,,0,,,,,J,jardins,,,650,3.836048,47.086522
