id_mutation,date_mutation,numero_disposition,nature_mutation,valeur_fonciere,adresse_numero,adresse_suffixe,adresse_nom_voie,adresse_code_voie,code_postal,code_commune,nom_commune,code_departement,ancien_code_commune,ancien_nom_commune,id_parcelle,ancien_id_parcelle,numero_volume,lot1_numero,lot1_surface_carrez,lot2_numero,lot2_surface_carrez,lot3_numero,lot3_surface_carrez,lot4_numero,lot4_surface_carrez,lot5_numero,lot5_surface_carrez,nombre_lots,code_type_local,type_local,surface_reelle_bati,nombre_pieces_principales,code_nature_culture,nature_culture,code_nature_culture_speciale,nature_culture_speciale,surface_terrain,longitude,latitude
2021-945956,2021-01-26,000001,Vente,4000,,,BOIS DE MONTJOUAND,B030,58370,58140,Larochemillay,58,,,581400000G0153,,,,,,,,,,,,,0,,,,,T,terres,,,3445,3.942535,46.898587
2021-945956,2021-01-26,000001,Vente,4000,,,SUR LA LONGUE,B249,58370,58140,Larochemillay,58,,,581400000G0246,,,,,,,,,,,,,0,,,,,BT,taillis simples,,,7465,3.945046,46.895431
2021-945956,2021-01-26,000001,Vente,4000,,,CHAMPS DU PATUREAU,B128,58370,58140,Larochemillay,58,,,581400000G0651,,,,,,,,,,,,,0,,,,,T,terres,,,1389,3.947226,46.894344
2021-945956,2021-01-26,000001,Vente,4000,,,CHAMPS DU PATUREAU,B128,58370,58140,Larochemillay,58,,,581400000G0658,,,,,,,,,,,,,0,,,,,P,prés,,,6390,3.945453,46.894698
2021-945956,2021-01-26,000001,Vente,4000,,,LE PETIT BOIS,B282,58370,58140,Larochemillay,58,,,581400000G0664,,,,,,,,,,,,,0,,,,,BT,taillis simples,,,4990,3.949399,46.895258
2021-945956,2021-01-26,000001,Vente,4000,,,LE PETIT BOIS,B282,58370,58140,Larochemillay,58,,,581400000G0667,,,,,,,,,,,,,0,,,,,BT,taillis simples,,,5370,3.949188,46.896182
2021-945956,2021-01-26,000001,Vente,4000,,,PRES DE MONTJUANT,B322,58370,58140,Larochemillay,58,,,581400000G0683,,,,,,,,,,,,,0,,,,,BT,taillis simples,,,995,3.949451,46.896477
2021-946514,2021-03-16,000001,Vente,36000,14,,RTE DE LUZY,0220,58370,58140,Larochemillay,58,,,581400000B0279,,,,,,,,,,,,,0,1,Maison,41,3,S,sols,,,46,4.001142,46.876704
2021-946825,2021-03-30,000001,Vente,26500,1,,RTE DE PETITON,0270,58370,58140,Larochemillay,58,,,581400000D0052,,,,,,,,,,,,,0,1,Maison,62,2,S,sols,,,160,4.009717,46.893855
2021-946825,2021-03-30,000001,Vente,26500,,,LE CROT DES HATES,B157,58370,58140,Larochemillay,58,,,581400000D0053,,,,,,,,,,,,,0,,,,,P,prés,,,1850,4.010111,46.893826
2021-946825,2021-03-30,000001,Vente,26500,,,LE CROT DES HATES,B157,58370,58140,Larochemillay,58,,,581400000D0613,,,,,,,,,,,,,0,,,,,S,sols,,,7,4.009929,46.893775
2021-947009,2021-04-19,000001,Vente,500,,,SUR LES VIGNES,B373,58370,58140,Larochemillay,58,,,581400000G0844,,,,,,,,,,,,,0,,,,,P,prés,,,4407,3.949036,46.887903
2021-947009,2021-04-19,000001,Vente,500,,,SUR LES VIGNES,B373,58370,58140,Larochemillay,58,,,581400000G0845,,,,,,,,,,,,,0,,,,,P,prés,,,2718,3.948558,46.887338
2021-947037,2021-04-16,000001,Vente,4400,,,MONTCENIS,B263,58370,58140,Larochemillay,58,,,581400000G0542,,,,,,,,,,,,,0,,,,,P,prés,,,4850,3.946532,46.88274
2021-947037,2021-04-16,000001,Vente,4400,,,BOIS DE BUZON,B022,58370,58140,Larochemillay,58,,,581400000G0574,,,,,,,,,,,,,0,,,,,P,prés,,,4285,3.947319,46.887656
2021-947037,2021-04-16,000001,Vente,4400,,,BOIS DE BUZON,B022,58370,58140,Larochemillay,58,,,581400000G0575,,,,,,,,,,,,,0,,,,,BT,taillis simples,,,465,3.947518,46.888018
2021-947037,2021-04-16,000001,Vente,4400,,,BOIS DE BUZON,B022,58370,58140,Larochemillay,58,,,581400000G0580,,,,,,,,,,,,,0,,,,,P,prés,,,2855,3.948577,46.888242
2021-947037,2021-04-16,000001,Vente,4400,,,BOIS DE BUZON,B022,58370,58140,Larochemillay,58,,,581400000G0581,,,,,,,,,,,,,0,,,,,BT,taillis simples,,,3322,3.947629,46.888466
2021-947037,2021-04-16,000001,Vente,4400,,,BOIS DE BUZON,B022,58370,58140,Larochemillay,58,,,581400000G0583,,,,,,,,,,,,,0,,,,,BT,taillis simples,,,5479,3.946762,46.888063
2021-947037,2021-04-16,000001,Vente,4400,,,PRE VERS L EAU,B311,58370,58140,Larochemillay,58,,,581400000G0731,,,,,,,,,,,,,0,,,,,P,prés,,,5990,3.956839,46.8882
2021-947037,2021-04-16,000001,Vente,4400,,,PRE BOURBE,B300,58370,58140,Larochemillay,58,,,581400000G0791,,,,,,,,,,,,,0,,,,,P,prés,,,2665,3.956633,46.889652
2021-947037,2021-04-16,000002,Vente,4400,,,BOIS DE BUZON,B022,58370,58140,Larochemillay,58,,,581400000G0578,,,,,,,,,,,,,0,,,,,BT,taillis simples,,,874,3.947415,46.88813
2021-947037,2021-04-16,000002,Vente,4400,,,BOIS DE BUZON,B022,58370,58140,Larochemillay,58,,,581400000G0582,,,,,,,,,,,,,0,,,,,BT,taillis simples,,,3330,3.946806,46.88872
2021-947625,2021-05-18,000001,Vente,5000,,,LES VIEILLES MAISONS,B372,58370,58140,Larochemillay,58,,,581400000A0070,,,,,,,,,,,,,0,,,,,P,prés,,,1825,4.014096,46.920642
2021-947625,2021-05-18,000001,Vente,5000,5,,RTE DES VIEILLES MAISONS,0355,58370,58140,Larochemillay,58,,,581400000A0071,,,,,,,,,,,,,0,1,Maison,33,0,S,sols,,,815,4.014195,46.92047
2021-947712,2021-02-28,000001,Vente,150,,,LES PLAISIES,B293,58370,58140,Larochemillay,58,,,581400000F0238,,,,,,,,,,,,,0,,,,,BT,taillis simples,,,530,3.936052,46.906814
2021-947712,2021-02-28,000001,Vente,150,,,LES PLAISIES,B293,58370,58140,Larochemillay,58,,,581400000F0239,,,,,,,,,,,,,0,,,,,P,prés,,,603,3.936217,46.907009
2021-947712,2021-02-28,000001,Vente,150,,,LES GARENNES,B194,58370,58140,Larochemillay,58,,,581400000F0356,,,,,,,,,,,,,0,,,,,BT,taillis simples,,,370,3.937744,46.90473
2021-947713,2021-02-28,000001,Vente,15000,,,ECHEINTRE DU SANGLIER,B170,58370,58140,Larochemillay,58,,,581400000E0159,,,,,,,,,,,,,0,,,,,BS,taillis sous futaie,,,46935,3.958399,46.912476
2021-947713,2021-02-28,000001,Vente,15000,,,ECHEINTRE DU SANGLIER,B170,58370,58140,Larochemillay,58,,,581400000E0160,,,,,,,,,,,,,0,,,,,L,landes,,,21280,3.957552,46.911333
2021-947713,2021-02-28,000001,Vente,15000,,,LES GOUTTES,B206,58370,58140,Larochemillay,58,,,581400000E0168,,,,,,,,,,,,,0,,,,,L,landes,,,6955,3.955666,46.909938
2021-947713,2021-02-28,000001,Vente,15000,,,LES GOUTTES,B206,58370,58140,Larochemillay,58,,,581400000E0170,,,,,,,,,,,,,0,,,,,BT,taillis simples,,,7000,3.954946,46.909915
2021-947713,2021-02-28,000001,Vente,15000,,,LES GOUTTES,B206,58370,58140,Larochemillay,58,,,581400000E0181,,,,,,,,,,,,,0,,,,,BS,taillis sous futaie,,,1650,3.953125,46.908723
2021-947713,2021-02-28,000001,Vente,15000,,,BOIS BREUILLARD,B019,58370,58140,Larochemillay,58,,,581400000F0376,,,,,,,,,,,,,0,,,,,BT,taillis simples,,,960,3.941185,46.90403
2021-947713,2021-02-28,000001,Vente,15000,,,BOIS BREUILLARD,B019,58370,58140,Larochemillay,58,,,581400000F0378,,,,,,,,,,,,,0,,,,,BT,taillis simples,,,1220,3.940528,46.904162
2021-947713,2021-02-28,000001,Vente,15000,,,SOUS BREUILLARD,B352,58370,58140,Larochemillay,58,,,581400000F0407,,,,,,,,,,,,,0,,,,,T,terres,,,4895,3.941904,46.902108
2021-947713,2021-02-28,000001,Vente,15000,,,MONTJOUANT,B267,58370,58140,Larochemillay,58,,,581400000F0615,,,,,,,,,,,,,0,,,,,P,prés,,,2553,3.945784,46.900351
2021-947713,2021-02-28,000001,Vente,15000,,,BOIS DE MONTJOUAND,B030,58370,58140,Larochemillay,58,,,581400000G0147,,,,,,,,,,,,,0,,,,,BT,taillis simples,,,1500,3.940211,46.897405
2021-947713,2021-02-28,000001,Vente,15000,,,PRES DU MOULIN,B327,58370,58140,Larochemillay,58,,,581400000G0185,,,,,,,,,,,,,0,,,,,BT,taillis simples,,,1060,3.944769,46.897998
2021-948149,2021-06-17,000001,Vente,145000,,,LE RUAULT,B344,58370,58140,Larochemillay,58,,,581400000D0349,,,,,,,,,,,,,0,,,,,S,sols,,,410,4.00554,46.893197
2021-948149,2021-06-17,000001,Vente,145000,,,LE RUAULT,B344,58370,58140,Larochemillay,58,,,581400000D0349,,,,,,,,,,,,,0,,,,,P,prés,,,6995,4.00554,46.893197
2021-948149,2021-06-17,000001,Vente,145000,5,,CHE DU MOULIN,0255,58370,58140,Larochemillay,58,,,581400000D0350,,,,,,,,,,,,,0,1,Maison,75,3,S,sols,,,435,4.005754,46.892765
2021-948149,2021-06-17,000001,Vente,145000,,,LE RUAULT,B344,58370,58140,Larochemillay,58,,,581400000D0352,,,,,,,,,,,,,0,,,,,P,prés,,,4308,4.004429,46.893275
2021-948149,2021-06-17,000001,Vente,145000,,,LE RUAULT,B344,58370,58140,Larochemillay,58,,,581400000D0353,,,,,,,,,,,,,0,,,,,P,prés,,,6526,4.003787,46.893483
2021-948149,2021-06-17,000001,Vente,145000,,,LE RUAULT,B344,58370,58140,Larochemillay,58,,,581400000D0678,,,,,,,,,,,,,0,,,,,S,sols,,,2065,4.005134,46.892697
2021-949099,2021-07-13,000001,Vente,20590,1,,IMP DE LA GARENNE DE COUVEAU,0175,58370,58140,Larochemillay,58,,,581400000B0735,,,,,,,,,,,,,0,,,,,AB,terrains a bâtir,,,1038,4.00225,46.873753
2021-949099,2021-07-13,000001,Vente,20590,,,LA GARENNE DE COUVEAU,B193,58370,58140,Larochemillay,58,,,581400000B0736,,,,,,,,,,,,,0,,,,,AB,terrains a bâtir,,,1021,4.002399,46.873485
2021-949144,2021-07-22,000001,Vente,30000,1,,CHE DU RUAULT,0320,58370,58140,Larochemillay,58,,,581400000D0625,,,,,,,,,,,,,0,1,Maison,37,1,S,sols,,,401,4.002433,46.890748
2021-949144,2021-07-22,000001,Vente,30000,1,,CHE DU RUAULT,0320,58370,58140,Larochemillay,58,,,581400000D0625,,,,,,,,,,,,,0,3,Dépendance,,0,S,sols,,,401,4.002433,46.890748
2021-950525,2021-10-04,000001,Echange,200,,,CHAMPS DU PATUREAU,B128,58370,58140,Larochemillay,58,,,581400000G0651,,,,,,,,,,,,,0,,,,,T,terres,,,1389,3.947226,46.894344
2021-950525,2021-10-04,000002,Echange,200,,,LE PETIT BOIS,B282,58370,58140,Larochemillay,58,,,581400000G0666,,,,,,,,,,,,,0,,,,,BT,taillis simples,,,2175,3.948985,46.895596
2021-950822,2021-10-30,000001,Vente,185900,,,LE CROT DES HATES,B157,58370,58140,Larochemillay,58,,,581400000D0050,,,,,,,,,,,,,0,,,,,T,terres,,,650,4.009575,46.894348
2021-950822,2021-10-30,000001,Vente,185900,3,,RTE DE PETITON,0270,58370,58140,Larochemillay,58,,,581400000D0051,,,,,,,,,,,,,0,1,Maison,172,4,S,sols,,,614,4.009649,46.894051
2021-950822,2021-10-30,000001,Vente,185900,3,,RTE DE PETITON,0270,58370,58140,Larochemillay,58,,,581400000D0051,,,,,,,,,,,,,0,3,Dépendance,,0,S,sols,,,614,4.009649,46.894051
2021-950844,2021-11-02,000001,Vente,2500,,,LES SARRAUTS,B347,58370,58140,Larochemillay,58,,,581400000F0176,,,,,,,,,,,,,0,,,,,BT,taillis simples,,,675,3.939278,46.910931
2021-950844,2021-11-02,000001,Vente,2500,,,LES SARRAUTS,B347,58370,58140,Larochemillay,58,,,581400000F0185,,,,,,,,,,,,,0,,,,,BT,taillis simples,,,1830,3.940236,46.910962
2021-950844,2021-11-02,000001,Vente,2500,,,CHAMPS DE REGIE,B112,58370,58140,Larochemillay,58,,,581400000F0258,,,,,,,,,,,,,0,,,,,BT,taillis simples,,,12490,3.930152,46.907013
2021-951623,2021-12-15,000001,Vente,90250,,,LE BOURG,B048,58370,58140,Larochemillay,58,,,581400000B0260,,,,,,,,,,,,,0,,,,,S,sols,,,16,4.001581,46.877716
2021-951623,2021-12-15,000001,Vente,90250,12,,PL DE L'EGLISE,0155,58370,58140,Larochemillay,58,,,581400000B0261,,,,,,,,,,,,,0,1,Maison,111,5,S,sols,,,94,4.001492,46.877763
2021-952193,2021-12-03,000001,Vente,1100,,,BEAUME ARRACHEE,B007,58370,58140,Larochemillay,58,,,581400000G0635,,,,,,,,,,,,,0,,,,,BT,taillis simples,,,6710,3.944474,46.892566
2021-952195,2021-12-03,000001,Vente,480,,,EN MONTCENIS,B262,58370,58140,Larochemillay,58,,,581400000G0269,,,,,,,,,,,,,0,,,,,BT,taillis simples,,,4825,3.939476,46.894413
