id_mutation,date_mutation,numero_disposition,nature_mutation,valeur_fonciere,adresse_numero,adresse_suffixe,adresse_nom_voie,adresse_code_voie,code_postal,code_commune,nom_commune,code_departement,ancien_code_commune,ancien_nom_commune,id_parcelle,ancien_id_parcelle,numero_volume,lot1_numero,lot1_surface_carrez,lot2_numero,lot2_surface_carrez,lot3_numero,lot3_surface_carrez,lot4_numero,lot4_surface_carrez,lot5_numero,lot5_surface_carrez,nombre_lots,code_type_local,type_local,surface_reelle_bati,nombre_pieces_principales,code_nature_culture,nature_culture,code_nature_culture_speciale,nature_culture_speciale,surface_terrain,longitude,latitude
2021-945682,2021-01-27,000001,Vente,185000,2,,RUE DES PUITS,0070,58270,58239,Saint-Firmin,58,,,582390000A0254,,,,,,,,,,,,,0,1,Maison,180,4,S,sols,,,1968,3.382353,47.044447
2021-945682,2021-01-27,000001,Vente,185000,2,,RUE DES PUITS,0070,58270,58239,Saint-Firmin,58,,,582390000A0254,,,,,,,,,,,,,0,3,Dépendance,,0,S,sols,,,1968,3.382353,47.044447
2021-945682,2021-01-27,000001,Vente,185000,,,CHAMP CHAUME BUSSY,B017,58270,58239,Saint-Firmin,58,,,582390000A0256,,,,,,,,,,,,,0,,,,,S,sols,,,729,3.382604,47.044521
2021-946127,2021-02-16,000001,Vente,4300,,,CHAMP DES COMES,B028,58270,58239,Saint-Firmin,58,,,582390000A0115,,,,,,,,,,,,,0,,,,,T,terres,,,3712,3.386571,47.040288
2021-946127,2021-02-16,000001,Vente,4300,,,CHAMP DES COMES,B028,58270,58239,Saint-Firmin,58,,,582390000A0120,,,,,,,,,,,,,0,,,,,T,terres,,,5883,3.389952,47.04106
2021-946127,2021-02-16,000001,Vente,4300,,,CHAMP DES COMES,B028,58270,58239,Saint-Firmin,58,,,582390000A0121,,,,,,,,,,,,,0,,,,,T,terres,,,4607,3.389395,47.040663
2021-947868,2021-05-19,000001,Vente,4000,,,VILLAGE DE SEPT VOIES,B119,58270,58239,Saint-Firmin,58,,,582390000C0406,,,,,,,,,,,,,0,,,,,S,sols,,,124,3.418897,47.039298
2021-948465,2021-06-23,000001,Vente,158000,,,L OUCHE DU PETIT DOMAINE,B076,58270,58239,Saint-Firmin,58,,,582390000B0182,,,,,,,,,,,,,0,,,,,P,prés,,,7825,3.391292,47.043443
2021-948465,2021-06-23,000001,Vente,158000,1,,RUE DES VIGNES,0100,58270,58239,Saint-Firmin,58,,,582390000B0185,,,,,,,,,,,,,0,3,Dépendance,,0,S,sols,,,810,3.391904,47.043096
2021-948465,2021-06-23,000001,Vente,158000,1,,RUE DES VIGNES,0100,58270,58239,Saint-Firmin,58,,,582390000B0185,,,,,,,,,,,,,0,1,Maison,180,5,S,sols,,,810,3.391904,47.043096
2021-951121,2021-11-19,000001,Vente,55000,1,,RUE DE L'HUILERIE,0030,58270,58239,Saint-Firmin,58,,,582390000B0197,,,,,,,,,,,,,0,1,Maison,91,4,S,sols,,,350,3.392234,47.042047
2021-951121,2021-11-19,000001,Vente,55000,,,LE ROUAU,B107,58270,58239,Saint-Firmin,58,,,582390000B0551,,,,,,,,,,,,,0,,,,,P,prés,,,2716,3.391986,47.042047
2021-951918,2021-12-15,000001,Vente,2000,,,VILLAGE DE SEPT VOIES,B119,58270,58239,Saint-Firmin,58,,,582390000C0118,,,,,,,,,,,,,0,,,,,S,sols,,,405,3.419088,47.039345
2021-951918,2021-12-15,000001,Vente,2000,,,VILLAGE DE SEPT VOIES,B119,58270,58239,Saint-Firmin,58,,,582390000C0119,,,,,,,,,,,,,0,,,,,S,sols,,,446,3.418909,47.039225
