id_mutation,date_mutation,numero_disposition,nature_mutation,valeur_fonciere,adresse_numero,adresse_suffixe,adresse_nom_voie,adresse_code_voie,code_postal,code_commune,nom_commune,code_departement,ancien_code_commune,ancien_nom_commune,id_parcelle,ancien_id_parcelle,numero_volume,lot1_numero,lot1_surface_carrez,lot2_numero,lot2_surface_carrez,lot3_numero,lot3_surface_carrez,lot4_numero,lot4_surface_carrez,lot5_numero,lot5_surface_carrez,nombre_lots,code_type_local,type_local,surface_reelle_bati,nombre_pieces_principales,code_nature_culture,nature_culture,code_nature_culture_speciale,nature_culture_speciale,surface_terrain,longitude,latitude
2021-946586,2021-03-03,000001,Vente,200,,,LE BEAUCHOT,B002,58350,58252,Saint-Malo-en-Donziois,58,,,58252000AA0014,,,,,,,,,,,,,0,,,,,VE,vergers,,,722,3.26387,47.331975
2021-947307,2021-04-30,000001,Vente,109000,,,LE BEAUCHOT,B002,58350,58252,Saint-Malo-en-Donziois,58,,,58252000YA0039,,,,,,,,,,,,,0,,,,,P,prés,,,905,3.266071,47.330904
2021-947307,2021-04-30,000001,Vente,109000,8,,RUE JULES PEROT,0050,58350,58252,Saint-Malo-en-Donziois,58,,,58252000YA0040,,,,,,,,,,,,,0,1,Maison,107,3,S,sols,,,592,3.265437,47.33115
2021-947307,2021-04-30,000001,Vente,109000,,,LE BEAUCHOT,B002,58350,58252,Saint-Malo-en-Donziois,58,,,58252000YA0041,,,,,,,,,,,,,0,,,,,P,prés,,,157,3.265275,47.331118
2021-947307,2021-04-30,000001,Vente,109000,,,LE BEAUCHOT,B002,58350,58252,Saint-Malo-en-Donziois,58,,,58252000YA0047,,,,,,,,,,,,,0,,,,,P,prés,,,44,3.265368,47.331079
2021-947307,2021-04-30,000001,Vente,109000,,,LE BEAUCHOT,B002,58350,58252,Saint-Malo-en-Donziois,58,,,58252000YA0048,,,,,,,,,,,,,0,,,,,P,prés,,,518,3.265696,47.331187
2021-947307,2021-04-30,000001,Vente,109000,,,LE BEAUCHOT,B002,58350,58252,Saint-Malo-en-Donziois,58,,,58252000YA0055,,,,,,,,,,,,,0,,,,,P,prés,,,1284,3.265814,47.330824
2021-948436,2021-07-02,000001,Vente,8000,17,,RTE LUCIE AUBRAC,0071,58350,58252,Saint-Malo-en-Donziois,58,,,58252000AC0036,,,,,,,,,,,,,0,1,Maison,70,3,S,sols,,,245,3.267729,47.312289
2021-949221,2021-07-08,000001,Vente,105000,,,RUE JULES PEROT,0050,58350,58252,Saint-Malo-en-Donziois,58,,,58252000AA0027,,,,,,,,,,,,,0,,,,,S,sols,,,783,3.264569,47.331135
2021-949221,2021-07-08,000001,Vente,105000,5,,RUE JULES PEROT,0050,58350,58252,Saint-Malo-en-Donziois,58,,,58252000AA0028,,,,,,,,,,,,,0,3,Dépendance,,0,S,sols,,,284,3.26448,47.330967
2021-949221,2021-07-08,000001,Vente,105000,5,,RUE JULES PEROT,0050,58350,58252,Saint-Malo-en-Donziois,58,,,58252000AA0028,,,,,,,,,,,,,0,3,Dépendance,,0,S,sols,,,284,3.26448,47.330967
2021-949221,2021-07-08,000001,Vente,105000,5,,RUE JULES PEROT,0050,58350,58252,Saint-Malo-en-Donziois,58,,,58252000AA0028,,,,,,,,,,,,,0,1,Maison,140,5,S,sols,,,284,3.26448,47.330967
2021-949221,2021-07-08,000001,Vente,105000,,,LE BEAUCHOT,B002,58350,58252,Saint-Malo-en-Donziois,58,,,58252000AA0029,,,,,,,,,,,,,0,,,,,S,sols,,,77,3.264371,47.330997
2021-949221,2021-07-08,000001,Vente,105000,,,LE BEAUCHOT,B002,58350,58252,Saint-Malo-en-Donziois,58,,,58252000AA0037,,,,,,,,,,,,,0,,,,,T,terres,,,16,3.26431,47.330726
2021-949780,2021-09-10,000001,Vente,90000,33,,RTE LUCIE AUBRAC,0071,58350,58252,Saint-Malo-en-Donziois,58,,,58252000AC0044,,,,,,,,,,,,,0,1,Maison,148,6,S,sols,,,862,3.266814,47.313132
2021-949780,2021-09-10,000001,Vente,90000,,,LE BOURG,B008,58350,58252,Saint-Malo-en-Donziois,58,,,58252000AC0045,,,,,,,,,,,,,0,,,,,P,prés,,,625,3.266219,47.313045
2021-952179,2021-12-23,000001,Vente,125000,22,,RTE LUCIE AUBRAC,0071,58350,58252,Saint-Malo-en-Donziois,58,,,58252000AC0004,,,,,,,,,,,,,0,1,Maison,105,4,S,sols,,,355,3.266493,47.314444
2021-952179,2021-12-23,000001,Vente,125000,22,,RTE LUCIE AUBRAC,0071,58350,58252,Saint-Malo-en-Donziois,58,,,58252000AC0004,,,,,,,,,,,,,0,1,Maison,105,4,T,terres,,,2595,3.266493,47.314444
2021-952179,2021-12-23,000001,Vente,125000,,,LE BOURG,B008,58350,58252,Saint-Malo-en-Donziois,58,,,58252000AC0068,,,,,,,,,,,,,0,,,,,P,prés,,,264,3.266563,47.314165
