id_mutation,date_mutation,numero_disposition,nature_mutation,valeur_fonciere,adresse_numero,adresse_suffixe,adresse_nom_voie,adresse_code_voie,code_postal,code_commune,nom_commune,code_departement,ancien_code_commune,ancien_nom_commune,id_parcelle,ancien_id_parcelle,numero_volume,lot1_numero,lot1_surface_carrez,lot2_numero,lot2_surface_carrez,lot3_numero,lot3_surface_carrez,lot4_numero,lot4_surface_carrez,lot5_numero,lot5_surface_carrez,nombre_lots,code_type_local,type_local,surface_reelle_bati,nombre_pieces_principales,code_nature_culture,nature_culture,code_nature_culture_speciale,nature_culture_speciale,surface_terrain,longitude,latitude
2021-946155,2021-02-05,000001,Vente,135000,,,LE CHARNAY,B011,58240,58294,Toury-sur-Jour,58,,,582940000A0048,,,,,,,,,,,,,0,,,,,P,prés,,,15000,3.242298,46.729309
2021-946155,2021-02-05,000001,Vente,135000,,,LE CHARNAY,B011,58240,58294,Toury-sur-Jour,58,,,582940000A0049,,,,,,,,,,,,,0,,,,,P,prés,,,4080,3.242994,46.728679
2021-946155,2021-02-05,000001,Vente,135000,,,LE CHARNAY,B011,58240,58294,Toury-sur-Jour,58,,,582940000A0049,,,,,,,,,,,,,0,,,,,S,sols,,,1920,3.242994,46.728679
2021-946155,2021-02-05,000001,Vente,135000,,,LE CHARNAY,B011,58240,58294,Toury-sur-Jour,58,,,582940000A0058,,,,,,,,,,,,,0,,,,,P,prés,,,9250,3.24704,46.729034
2021-946155,2021-02-05,000001,Vente,135000,,,LE BOURG,B007,58240,58294,Toury-sur-Jour,58,,,582940000A0102,,,,,,,,,,,,,0,,,,,J,jardins,,,915,3.241888,46.728741
2021-946155,2021-02-05,000001,Vente,135000,5,,RTE DE NEUVILLE,0008,58240,58294,Toury-sur-Jour,58,,,582940000A0103,,,,,,,,,,,,,0,1,Maison,88,3,S,sols,,,1950,3.242394,46.728633
2021-946155,2021-02-05,000001,Vente,135000,,,LE BOURG,B007,58240,58294,Toury-sur-Jour,58,,,582940000A0104,,,,,,,,,,,,,0,,,,,P,prés,,,2150,3.242453,46.728857
2021-946155,2021-02-05,000001,Vente,135000,,,LE BOURG,B007,58240,58294,Toury-sur-Jour,58,,,582940000A0105,,,,,,,,,,,,,0,,,,,T,terres,,,1530,3.241981,46.72915
2021-946155,2021-02-05,000001,Vente,135000,,,LE CHARNAY,B011,58240,58294,Toury-sur-Jour,58,,,582940000A0675,,,,,,,,,,,,,0,,,,,P,prés,,,30656,3.245307,46.728509
2021-946167,2021-02-16,000001,Vente,9920,,,LA TUILERIE,B039,58240,58294,Toury-sur-Jour,58,,,582940000A0721,,,,,,,,,,,,,0,,,,,AB,terrains a bâtir,,,784,3.240826,46.718618
2021-946167,2021-02-16,000001,Vente,9920,,,LA TUILERIE,B039,58240,58294,Toury-sur-Jour,58,,,582940000A0728,,,,,,,,,,,,,0,,,,,AB,terrains a bâtir,,,208,3.240842,46.718418
2021-946954,2021-03-20,000001,Vente,58000,18,,LA MATHURINE,B031,58240,58294,Toury-sur-Jour,58,,,582940000A0188,,,,,,,,,,,,,0,3,Dépendance,,0,S,sols,,,900,3.224059,46.724572
2021-946954,2021-03-20,000001,Vente,58000,18,,LA MATHURINE,B031,58240,58294,Toury-sur-Jour,58,,,582940000A0188,,,,,,,,,,,,,0,1,Maison,51,2,S,sols,,,900,3.224059,46.724572
2021-946954,2021-03-20,000001,Vente,58000,,,LA MATHURINE,B031,58240,58294,Toury-sur-Jour,58,,,582940000A0189,,,,,,,,,,,,,0,,,,,J,jardins,,,620,3.22445,46.724589
2021-946954,2021-03-20,000001,Vente,58000,,,LA MATHURINE,B031,58240,58294,Toury-sur-Jour,58,,,582940000A0604,,,,,,,,,,,,,0,,,,,P,prés,,,1366,3.224861,46.724595
2021-946954,2021-03-20,000001,Vente,58000,,,LA MATHURINE,B031,58240,58294,Toury-sur-Jour,58,,,582940000A0625,,,,,,,,,,,,,0,,,,,P,prés,,,223,3.224379,46.724729
2021-946954,2021-03-20,000001,Vente,58000,,,LA MATHURINE,B031,58240,58294,Toury-sur-Jour,58,,,582940000A0627,,,,,,,,,,,,,0,,,,,T,terres,,,70,3.224048,46.724743
2021-948350,2021-06-09,000001,Vente,19300,,,LA TUILERIE,B039,58240,58294,Toury-sur-Jour,58,,,582940000A0717,,,,,,,,,,,,,0,,,,,AB,terrains a bâtir,,,757,3.241485,46.718669
2021-948350,2021-06-09,000001,Vente,19300,,,LA TUILERIE,B039,58240,58294,Toury-sur-Jour,58,,,582940000A0719,,,,,,,,,,,,,0,,,,,AB,terrains a bâtir,,,788,3.241176,46.718642
2021-948350,2021-06-09,000001,Vente,19300,,,LA TUILERIE,B039,58240,58294,Toury-sur-Jour,58,,,582940000A0726,,,,,,,,,,,,,0,,,,,AB,terrains a bâtir,,,181,3.241512,46.718493
2021-948350,2021-06-09,000001,Vente,19300,,,LA TUILERIE,B039,58240,58294,Toury-sur-Jour,58,,,582940000A0727,,,,,,,,,,,,,0,,,,,AB,terrains a bâtir,,,204,3.24123,46.718443
2021-950157,2021-10-01,000001,Vente,1200000,,,BONBERNARD,B004,58240,58294,Toury-sur-Jour,58,,,582940000B0020,,,,,,,,,,,,,0,,,,,BS,taillis sous futaie,,,613340,3.292219,46.73705
