id_mutation,date_mutation,numero_disposition,nature_mutation,valeur_fonciere,adresse_numero,adresse_suffixe,adresse_nom_voie,adresse_code_voie,code_postal,code_commune,nom_commune,code_departement,ancien_code_commune,ancien_nom_commune,id_parcelle,ancien_id_parcelle,numero_volume,lot1_numero,lot1_surface_carrez,lot2_numero,lot2_surface_carrez,lot3_numero,lot3_surface_carrez,lot4_numero,lot4_surface_carrez,lot5_numero,lot5_surface_carrez,nombre_lots,code_type_local,type_local,surface_reelle_bati,nombre_pieces_principales,code_nature_culture,nature_culture,code_nature_culture_speciale,nature_culture_speciale,surface_terrain,longitude,latitude
2021-955399,2021-01-05,000001,Vente,78200,9,,RUE FRANKLIN,2200,59100,59512,Roubaix,59,,,59512000BZ0231,,,,,,,,,,,,,0,1,Maison,63,4,S,sols,,,58,3.188818,50.689016
2021-955402,2021-01-08,000001,Vente,110000,19,,RUE SOULT,5250,59100,59512,Roubaix,59,,,59512000CT0232,,,,,,,,,,,,,0,1,Maison,83,6,S,sols,,,109,3.198071,50.688037
2021-955403,2021-01-08,000001,Vente,80000,40,,RUE SAINT ELEUTHERE,4970,59100,59512,Roubaix,59,,,59512000BY0380,,,,,,,,,,,,,0,1,Maison,70,5,S,sols,,,50,3.18591,50.687521
2021-955429,2021-01-11,000001,Vente,104500,20,,BD DE COLMAR,1320,59100,59512,Roubaix,59,,,59512000CD0117,,,,,,,,,,,,,0,1,Maison,80,7,S,sols,,,66,3.188811,50.692103
2021-955459,2021-01-15,000001,Vente,236000,32,,RUE DE LA POTENNERIE,4600,59100,59512,Roubaix,59,,,59512000HS0281,,,,,,,,,,,,,0,1,Maison,148,7,S,sols,,,446,3.182818,50.682222
2021-955465,2021-01-18,000001,Vente,266000,,,,,,59512,Roubaix,59,,,59512000AZ0624,,1,,,,,,,,,,,0,,,,,,,,,,3.179328,50.695272
2021-955467,2021-01-11,000001,Vente,125500,46,,RES CHANTILLY RUE BARB,A030,59100,59512,Roubaix,59,,,59512000IL0076,,,23,,,,,,,,,,1,2,Appartement,97,4,,,,,,3.170364,50.681387
2021-955467,2021-01-11,000001,Vente,125500,9001,,RES CHANTILLY RUE BARB,A030,59100,59512,Roubaix,59,,,59512000IL0076,,,184,,,,,,,,,,1,3,Dépendance,,0,,,,,,3.170364,50.681387
2021-955497,2021-01-05,000001,Vente,123500,8,,RUE DU PROGRES,4620,59100,59512,Roubaix,59,,,59512000DW0277,,,,,,,,,,,,,0,1,Maison,100,5,S,sols,,,77,3.189013,50.686534
2021-955497,2021-01-05,000001,Vente,123500,10,,RUE DU PROGRES,4620,59100,59512,Roubaix,59,,,59512000DW0278,,,,,,,,,,,,,0,,,,,J,jardins,MARAI,Pré marais,78,3.189036,50.686594
2021-955497,2021-01-05,000001,Vente,123500,12,,RUE DU PROGRES,4620,59100,59512,Roubaix,59,,,59512000DW0279,,,,,,,,,,,,,0,,,,,J,jardins,MARAI,Pré marais,80,3.189128,50.686618
2021-955497,2021-01-05,000001,Vente,123500,14,,RUE DU PROGRES,4620,59100,59512,Roubaix,59,,,59512000DW0280,,,,,,,,,,,,,0,,,,,J,jardins,MARAI,Pré marais,129,3.189169,50.686693
2021-955498,2021-01-06,000001,Vente,265600,82,,RUE DECREME,1640,59100,59512,Roubaix,59,,,59512000HY0137,,,,,,,,,,,,,0,1,Maison,165,7,S,sols,,,255,3.181195,50.685137
2021-955499,2021-01-20,000001,Vente,83000,27,,RUE DE LEUZE,3240,59100,59512,Roubaix,59,,,59512000CW0829,,,,,,,,,,,,,0,1,Maison,96,3,S,sols,,,96,3.191318,50.687421
2021-955507,2021-01-11,000001,Vente,30000,,,RUE RICHARD LENOIR,4770,59100,59512,Roubaix,59,,,59512000MV0425,,1,,,,,,,,,,,0,,,,,,,,,,3.171448,50.698657
2021-955507,2021-01-11,000001,Vente,30000,,,RUE RICHARD LENOIR,4770,59100,59512,Roubaix,59,,,59512000MV0426,,,,,,,,,,,,,0,,,,,S,sols,,,88,3.171429,50.69857
2021-955516,2021-01-20,000001,Vente en l'état futur d'achèvement,165000,83,,RUE DE BARBIEUX,0420,59100,59512,Roubaix,59,,,59512000IW0074,,,16,,,,,,,,,,1,2,Appartement,42,2,,,,,,3.166888,50.676546
2021-955516,2021-01-20,000001,Vente en l'état futur d'achèvement,165000,83,,RUE DE BARBIEUX,0420,59100,59512,Roubaix,59,,,59512000IW0074,,,63,,,,,,,,,,1,3,Dépendance,,0,,,,,,3.166888,50.676546
2021-955517,2021-01-04,000001,Vente,258000,65,,RUE DU GRAND CHEMIN,2360,59100,59512,Roubaix,59,,,59512000LP0026,,,,,,,,,,,,,0,4,Local industriel. commercial ou assimilé,244,0,S,sols,,,127,3.164837,50.691485
2021-955517,2021-01-04,000001,Vente,258000,65,,RUE DU GRAND CHEMIN,2360,59100,59512,Roubaix,59,,,59512000LP0236,,,,,,,,,,,,,0,,,,,AB,terrains a bâtir,,,307,3.164705,50.691666
2021-955517,2021-01-04,000001,Vente,258000,,,RUE DU GRAND CHEMIN,2360,59100,59512,Roubaix,59,,,59512000LP0242,,,,,,,,,,,,,0,,,,,S,sols,,,125,3.164908,50.69159
2021-955518,2021-01-05,000001,Vente,120000,18,,RUE D AMSTERDAM,0180,59100,59512,Roubaix,59,,,59512000CK0073,,,,,,,,,,,,,0,1,Maison,62,4,S,sols,,,612,3.207826,50.689348
2021-955524,2021-01-15,000001,Vente,70000,3,,PL FOSSE AUX CHENES,2120,59100,59512,Roubaix,59,,,59512000MV0372,,,26,,,,,,,,,,1,2,Appartement,72,3,,,,,,3.174347,50.698925
2021-955526,2021-01-04,000003,Vente,120000,97,,RUE DE MOUVAUX,3901,59100,59512,Roubaix,59,,,59512000LN0259,,,,,,,,,,,,,0,,,,,S,sols,,,127,3.155719,50.694383
2021-955530,2021-01-11,000001,Vente,125200,107,,RUE DE FLANDRE,2060,59100,59512,Roubaix,59,,,59512000AI0188,,,,,,,,,,,,,0,1,Maison,75,5,S,sols,,,57,3.175758,50.702642
2021-955530,2021-01-11,000001,Vente,125200,105,,RUE DE FLANDRE,2060,59100,59512,Roubaix,59,,,59512000AI0189,,,,,,,,,,,,,0,1,Maison,75,5,S,sols,,,56,3.175797,50.702614
2021-955530,2021-01-11,000001,Vente,125200,22,,RUE DOMBASLE,1740,59100,59512,Roubaix,59,,,59512000AI0692,,,,,,,,,,,,,0,,,,,S,sols,,,23,3.175703,50.702567
2021-955530,2021-01-11,000001,Vente,125200,22,,RUE DOMBASLE,1740,59100,59512,Roubaix,59,,,59512000AI0693,,,,,,,,,,,,,0,,,,,S,sols,,,22,3.17565,50.702596
2021-955534,2021-01-18,000001,Vente,86500,13,,AV J BAPTISTE LEBAS,2800,59100,59512,Roubaix,59,,,59512000LT0039,,,5,58.4,,,,,,,,,1,2,Appartement,60,3,,,,,,3.171796,50.691947
2021-955545,2021-01-12,000001,Vente,335000,118,,RUE DAVID D ANGERS,1620,59100,59512,Roubaix,59,,,59512000HK0346,,,,,,,,,,,,,0,1,Maison,120,5,S,sols,,,271,3.18033,50.672542
2021-955545,2021-01-12,000001,Vente,335000,,,RUE DAVID D ANGERS,1620,59100,59512,Roubaix,59,,,59512000HK0432,,,,,,,,,,,,,0,,,,,S,sols,,,75,3.180466,50.672472
2021-955561,2021-01-20,000001,Vente,270000,91,,RUE DAMPIERRE,1580,59100,59512,Roubaix,59,,,59512000CV0247,,,,,,,,,,,,,0,,,,,S,sols,,,45,3.197806,50.690256
2021-955561,2021-01-20,000001,Vente,270000,14,,RUE DAMPIERRE,1580,59100,59512,Roubaix,59,,,59512000CV0248,,,,,,,,,,,,,0,,,,,S,sols,,,48,3.19778,50.69029
2021-955561,2021-01-20,000001,Vente,270000,6,T,RUE MOLIERE,3810,59100,59512,Roubaix,59,,,59512000CV0725,,,,,,,,,,,,,0,,,,,AB,terrains a bâtir,,,1845,3.19816,50.690272
2021-955561,2021-01-20,000001,Vente,270000,6,Q,RUE MOLIERE,3810,59100,59512,Roubaix,59,,,59512000CV0728,,,,,,,,,,,,,0,,,,,AB,terrains a bâtir,,,858,3.198755,50.690294
2021-955561,2021-01-20,000001,Vente,270000,,,RUE DU PILE,4540,59100,59512,Roubaix,59,,,59512000CV0815,,,,,,,,,,,,,0,,,,,AB,terrains a bâtir,,,327,3.198248,50.690051
2021-955561,2021-01-20,000001,Vente,270000,,,RUE MOLIERE,3810,59100,59512,Roubaix,59,,,59512000CV0817,,,,,,,,,,,,,0,,,,,AB,terrains a bâtir,,,231,3.198567,50.690135
2021-955561,2021-01-20,000001,Vente,270000,91,,RUE DAMPIERRE,1580,59100,59512,Roubaix,59,,,59512000CV0830,,,,,,,,,,,,,0,,,,,S,sols,,,2,3.197681,50.690269
2021-955561,2021-01-20,000001,Vente,270000,8,,IMP ORANGE RUE DAMPIERRE,4143,59100,59512,Roubaix,59,,,59512000CV0852,,,,,,,,,,,,,0,,,,,S,sols,,,51,3.197946,50.690072
2021-955561,2021-01-20,000001,Vente,270000,91,,RUE DAMPIERRE,1580,59100,59512,Roubaix,59,,,59512000CV0855,,,,,,,,,,,,,0,,,,,S,sols,,,62,3.19791,50.690105
2021-955561,2021-01-20,000001,Vente,270000,91,,RUE DAMPIERRE,1580,59100,59512,Roubaix,59,,,59512000CV0857,,,,,,,,,,,,,0,,,,,S,sols,,,49,3.197874,50.690156
2021-955561,2021-01-20,000001,Vente,270000,11,,IMP ORANGE RUE DAMPIERRE,4143,59100,59512,Roubaix,59,,,59512000CV0859,,,,,,,,,,,,,0,,,,,S,sols,,,52,3.19785,50.690185
2021-955561,2021-01-20,000001,Vente,270000,12,,IMP ORANGE RUE DAMPIERRE,4143,59100,59512,Roubaix,59,,,59512000CV0861,,,,,,,,,,,,,0,,,,,S,sols,,,49,3.197821,50.690228
2021-955561,2021-01-20,000001,Vente,270000,15,,IMP ORANGE RUE DAMPIERRE,4143,59100,59512,Roubaix,59,,,59512000CV0863,,,,,,,,,,,,,0,,,,,S,sols,,,27,3.197762,50.690317
2021-955561,2021-01-20,000001,Vente,270000,,,RUE MOLIERE,3810,59100,59512,Roubaix,59,,,59512000CV0866,,,,,,,,,,,,,0,,,,,AB,terrains a bâtir,,,38,3.19791,50.69036
2021-955561,2021-01-20,000001,Vente,270000,6,B,RUE MOLIERE,3810,59100,59512,Roubaix,59,,,59512000CV0868,,,,,,,,,,,,,0,,,,,AB,terrains a bâtir,,,217,3.198405,50.690504
2021-955561,2021-01-20,000001,Vente,270000,6,T,RUE MOLIERE,3810,59100,59512,Roubaix,59,,,59512000CV0870,,,,,,,,,,,,,0,,,,,AB,terrains a bâtir,,,11,3.198114,50.690414
2021-955562,2021-01-14,000001,Vente,109000,50,,RUE DU GENERAL CHANZY,2310,59100,59512,Roubaix,59,,,59512000IK0019,,,202,59.36,,,,,,,,,1,2,Appartement,59,3,,,,,,3.175188,50.685037
2021-955562,2021-01-14,000001,Vente,109000,50,,RUE DU GENERAL CHANZY,2310,59100,59512,Roubaix,59,,,59512000IK0019,,,321,,,,,,,,,,1,3,Dépendance,,0,,,,,,3.175188,50.685037
2021-955574,2021-01-22,000001,Vente en l'état futur d'achèvement,178000,83,,RUE DE BARBIEUX,0420,59100,59512,Roubaix,59,,,59512000IW0074,,,24,,,,,,,,,,1,2,Appartement,41,2,,,,,,3.166888,50.676546
2021-955574,2021-01-22,000001,Vente en l'état futur d'achèvement,178000,83,,RUE DE BARBIEUX,0420,59100,59512,Roubaix,59,,,59512000IW0074,,,57,,,,,,,,,,1,3,Dépendance,,0,,,,,,3.166888,50.676546
2021-955578,2021-01-14,000001,Vente,170000,30,,RUE DU CHEVALIER ROLAND,1220,59100,59512,Roubaix,59,,,59512000EH0107,,,,,,,,,,,,,0,1,Maison,100,5,S,sols,,,86,3.191654,50.682785
2021-955585,2021-01-08,000001,Vente,95000,102,,RUE CARPEAUX,0980,59100,59512,Roubaix,59,,,59512000HO0173,,,,,,,,,,,,,0,1,Maison,78,4,S,sols,,,88,3.182749,50.675558
2021-955599,2021-01-07,000001,Vente,200000,60,,AV JEAN JAURES,2860,59100,59512,Roubaix,59,,,59512000IZ0013,,,221,,,,,,,,,,1,3,Dépendance,,0,,,,,,3.159269,50.676809
2021-955599,2021-01-07,000001,Vente,200000,60,,AV JEAN JAURES,2860,59100,59512,Roubaix,59,,,59512000IZ0013,,,210,,,,,,,,,,1,3,Dépendance,,0,,,,,,3.159269,50.676809
2021-955599,2021-01-07,000001,Vente,200000,60,,AV JEAN JAURES,2860,59100,59512,Roubaix,59,,,59512000IZ0013,,,52,93.4,,,,,,,,,1,2,Appartement,87,4,,,,,,3.159269,50.676809
2021-955603,2021-01-07,000001,Vente,152000,60,,AV JEAN JAURES,2860,59100,59512,Roubaix,59,,,59512000IZ0013,,,31,79.1,,,,,,,,,1,2,Appartement,74,3,,,,,,3.159269,50.676809
2021-955603,2021-01-07,000001,Vente,152000,60,,AV JEAN JAURES,2860,59100,59512,Roubaix,59,,,59512000IZ0013,,,262,,,,,,,,,,1,3,Dépendance,,0,,,,,,3.159269,50.676809
2021-955605,2021-01-15,000001,Vente,62000,25,,RUE DE SAINT QUENTIN,5100,59100,59512,Roubaix,59,,,59512000BY0399,,,,,,,,,,,,,0,1,Maison,77,4,S,sols,,,63,3.18563,50.687635
2021-955606,2021-01-21,000001,Vente,127000,27,,AV DES NATIONS UNIES,4005,59100,59512,Roubaix,59,,,59512000BV0147,,,24,,,,,,,,,,1,3,Dépendance,,0,,,,,,3.183714,50.693048
2021-955606,2021-01-21,000001,Vente,127000,130,,GR GRANDE RUE,2380,59100,59512,Roubaix,59,,,59512000BV0147,,,2,,34,,,,,,,,2,2,Appartement,98,4,,,,,,3.183714,50.693048
2021-955608,2021-01-25,000001,Vente en l'état futur d'achèvement,125000,83,,RUE DE BARBIEUX,0420,59100,59512,Roubaix,59,,,59512000IW0074,,,10,,,,,,,,,,1,2,Appartement,29,1,,,,,,3.166888,50.676546
2021-955610,2021-01-19,000001,Vente,140000,10,,RUE EDGARD QUINET,1860,59100,59512,Roubaix,59,,,59512000EZ0165,,,,,,,,,,,,,0,1,Maison,82,4,S,sols,,,66,3.185351,50.676955
2021-955613,2021-01-07,000001,Vente,119375,33,,RUE DE FLORENCE,2080,59100,59512,Roubaix,59,,,59512000MN0436,,,,,,,,,,,,,0,1,Maison,90,4,S,sols,,,64,3.155843,50.695176
2021-955623,2021-01-11,000001,Vente,95000,28,,RUE COLBERT,1290,59100,59512,Roubaix,59,,,59512000KN0299,,,1,40.5,,,,,,,,,1,2,Appartement,30,1,,,,,,3.166582,50.684119
2021-955623,2021-01-11,000001,Vente,95000,28,,RUE COLBERT,1290,59100,59512,Roubaix,59,,,59512000KN0299,,,1,40.5,4,,,,,,,,2,4,Local industriel. commercial ou assimilé,10,0,,,,,,3.166582,50.684119
2021-955633,2021-01-06,000001,Vente,72500,9,B,RUE DES SEPT PONTS,5210,59100,59512,Roubaix,59,,,59512000AK0439,,,,,,,,,,,,,0,4,Local industriel. commercial ou assimilé,124,0,S,sols,,,118,3.17623,50.699585
2021-955633,2021-01-06,000001,Vente,72500,9,B,RUE DES SEPT PONTS,5210,59100,59512,Roubaix,59,,,59512000AK0439,,,,,,,,,,,,,0,1,Maison,50,1,S,sols,,,118,3.17623,50.699585
2021-955671,2021-01-15,000001,Vente en l'état futur d'achèvement,186083.33,25,,RUE DE LILLE,3300,59100,59512,Roubaix,59,,,59512000KP0257,,,108,,,,,,,,,,1,2,Appartement,64,3,,,,,,3.173037,50.686771
2021-955671,2021-01-15,000001,Vente en l'état futur d'achèvement,186083.33,25,,RUE DE LILLE,3300,59100,59512,Roubaix,59,,,59512000KP0257,,,427,,,,,,,,,,1,3,Dépendance,,0,,,,,,3.173037,50.686771
2021-955672,2021-01-07,000001,Vente,111000,32,B,AV ROGER SALENGRO,4810,59100,59512,Roubaix,59,,,59512000DP0019,,,146,,,,,,,,,,1,3,Dépendance,,0,,,,,,3.20019,50.677535
2021-955672,2021-01-07,000001,Vente,111000,32,,AV ROGER SALENGRO,4810,59100,59512,Roubaix,59,,,59512000DP0019,,,23,,50,,,,,,,,2,2,Appartement,52,2,,,,,,3.20019,50.677535
2021-955677,2021-01-18,000001,Vente,50000,6,,RUE DE LA PROVIDENCE,4640,59100,59512,Roubaix,59,,,59512000LP0168,,,,,,,,,,,,,0,1,Maison,92,4,S,sols,,,40,3.163774,50.689713
2021-955691,2021-01-25,000001,Vente,90000,145,,RUE DE CARTIGNY,0990,59100,59512,Roubaix,59,,,59512000AS0212,,,,,,,,,,,,,0,1,Maison,60,3,S,sols,,,46,3.192258,50.701733
2021-955691,2021-01-25,000001,Vente,90000,143,,RUE DE CARTIGNY,0990,59100,59512,Roubaix,59,,,59512000AS0213,,,,,,,,,,,,,0,,,,,S,sols,,,64,3.192187,50.701701
2021-955718,2021-01-25,000001,Vente,120000,28,,PL DU TRAVAIL,5390,59100,59512,Roubaix,59,,,59512000HM0238,,,,,,,,,,,,,0,1,Maison,105,4,S,sols,,,48,3.178248,50.676913
2021-955721,2021-01-22,000001,Vente,178000,34,,RUE MEISSONIER,3700,59100,59512,Roubaix,59,,,59512000HN0307,,,,,,,,,,,,,0,1,Maison,110,5,S,sols,,,75,3.17968,50.677012
2021-955721,2021-01-22,000001,Vente,178000,29,,RUE DE L AMIRAL DUQUESNE,0160,59100,59512,Roubaix,59,,,59512000HN0321,,,,,,,,,,,,,0,3,Dépendance,,0,S,sols,,,18,3.179388,50.67711
2021-955721,2021-01-22,000001,Vente,178000,,,RUE DE L AMIRAL DUQUESNE,0160,59100,59512,Roubaix,59,,,59512000HN0431,,,,,,,,,,,,,0,,,,,S,sols,,,60,3.179511,50.677065
2021-955722,2021-01-22,000001,Vente,84500,22,,RUE DE LA BASSE MASURE,0450,59100,59512,Roubaix,59,,,59512000AK0137,,,,,,,,,,,,,0,1,Maison,59,4,S,sols,,,66,3.176289,50.701248
2021-955734,2021-01-27,000001,Vente,47500,39,,RUE DE L OUEST,4170,59100,59512,Roubaix,59,,,59512000MN0197,,,12,17.67,,,,,,,,,1,2,Appartement,17,1,,,,,,3.161366,50.695858
2021-955749,2021-01-15,000001,Vente,8500,9008,,RUE DU CHEMIN NEUF,1190,59100,59512,Roubaix,59,,,59512000EW0071,,,,,,,,,,,,,0,3,Dépendance,,0,S,sols,,,17,3.193192,50.674517
2021-955751,2021-01-19,000001,Vente,64000,6,,RUE MARIE ET PIERRE CURIE,3575,59100,59512,Roubaix,59,,,59512000AS0322,,,,,,,,,,,,,0,1,Maison,52,3,S,sols,,,53,3.190387,50.702082
2021-955777,2021-01-18,000002,Vente,509440.8,8,,RUE DE MOUVAUX,3901,59100,59512,Roubaix,59,,,59512000LY0373,,,,,,,,,,,,,0,,,,,AB,terrains a bâtir,,,462,3.160857,50.693928
2021-955777,2021-01-18,000002,Vente,509440.8,10,B,RUE DE MOUVAUX,3901,59100,59512,Roubaix,59,,,59512000MN0606,,,,,,,,,,,,,0,,,,,AB,terrains a bâtir,,,779,3.160594,50.694009
2021-955789,2021-01-15,000001,Vente,100500,14,T,RUE BOURGELAT,0800,59100,59512,Roubaix,59,,,59512000LM0239,,,,,,,,,,,,,0,1,Maison,60,5,S,sols,,,80,3.154579,50.691162
2021-955794,2021-01-18,000001,Vente,87000,62,,RUE HENRI DUNANT,2555,59100,59512,Roubaix,59,,,59512000HW0272,,,34,,,,,,,,,,1,2,Appartement,93,4,,,,,,3.183,50.689227
2021-955806,2021-01-26,000001,Vente,40000,167,Q,RUE DE LANNOY,3110,59100,59512,Roubaix,59,,,59512000BY0477,,,21,,,,,,,,,,1,2,Appartement,43,2,,,,,,3.186456,50.686569
2021-955821,2021-01-21,000001,Vente,189800,114,B,BD DU GENERAL DE GAULLE,2312,59100,59512,Roubaix,59,,,59512000KN0111,,,54,,,,,,,,,,1,3,Dépendance,,0,,,,,,3.167669,50.681817
2021-955821,2021-01-21,000001,Vente,189800,114,B,RES SERPENTINE B GEN DE GAULLE,A165,59100,59512,Roubaix,59,,,59512000KN0111,,,45,,,,,,,,,,1,3,Dépendance,,0,,,,,,3.167669,50.681817
2021-955821,2021-01-21,000001,Vente,189800,114,B,RES SERPENTINE B GEN DE GAULLE,A165,59100,59512,Roubaix,59,,,59512000KN0111,,,56,,,,,,,,,,1,2,Appartement,122,4,,,,,,3.167669,50.681817
2021-955833,2021-01-25,000001,Vente,107131,70,,RUE DAUBENTON,1610,59100,59512,Roubaix,59,,,59512000AK0219,,,,,,,,,,,,,0,1,Maison,126,5,S,sols,,,79,3.177933,50.700775
2021-955850,2021-01-25,000001,Vente,144000,1,,ALL REMBRANDT,4733,59100,59512,Roubaix,59,,,59512000ET0269,,,,,,,,,,,,,0,1,Maison,91,5,S,sols,,,102,3.187175,50.67208
2021-955854,2021-01-13,000001,Vente,725350,51,,BD DU GENERAL DE GAULLE,2312,59100,59512,Roubaix,59,,,59512000IK0021,,,,,,,,,,,,,0,1,Maison,247,9,S,sols,,,752,3.172174,50.684336
2021-955857,2021-01-08,000001,Vente,89000,36,,RUE DU GENERAL SARRAIL,2330,59100,59512,Roubaix,59,,,59512000LT0111,,,10,51.13,,,,,,,,,1,2,Appartement,57,2,,,,,,3.170815,50.691706
2021-955883,2021-01-13,000001,Vente,121300,46,,RES CHANTILLY RUE BARB,A030,59100,59512,Roubaix,59,,,59512000IL0076,,,163,,70,66.9,,,,,,,2,2,Appartement,66,3,,,,,,3.170364,50.681387
2021-955894,2021-01-22,000001,Vente,130000,210,,RUE HENRI REGNAULT,2590,59100,59512,Roubaix,59,,,59512000HI0089,,,,,,,,,,,,,0,1,Maison,70,3,S,sols,,,66,3.182282,50.671912
2021-955895,2021-01-15,000001,Vente,177510,9001,,RES GIVERNY BRD DE DOUAI,A006,59100,59512,Roubaix,59,,,59512000IL0002,,,13,,75,,,,,,,,2,2,Appartement,96,4,,,,,,3.169531,50.680797
2021-955895,2021-01-15,000001,Vente,177510,9001,,RES GIVERNY BRD DE DOUAI,A006,59100,59512,Roubaix,59,,,59512000IL0002,,,112,,,,,,,,,,1,3,Dépendance,,0,,,,,,3.169531,50.680797
2021-955902,2021-01-11,000001,Vente en l'état futur d'achèvement,205780,121,,RUE D ISLY,2750,59100,59512,Roubaix,59,,,59512000KT0347,,,217,,,,,,,,,,1,,,,,,,,,,3.162531,50.685123
2021-955902,2021-01-11,000001,Vente en l'état futur d'achèvement,205780,121,,RUE D ISLY,2750,59100,59512,Roubaix,59,,,59512000KT0347,,,14,,,,,,,,,,1,,,,,,,,,,3.162531,50.685123
2021-955904,2021-01-13,000001,Vente,293000,229,,AV ROGER SALENGRO,4810,59100,59512,Roubaix,59,,,59512000DK0014,,,,,,,,,,,,,0,1,Maison,121,4,S,sols,,,755,3.205096,50.682239
2021-955905,2021-01-18,000001,Vente,56000,142,,RUE ROLLIN,4830,59100,59512,Roubaix,59,,,59512000AH0436,,,402,51,,,,,,,,,1,2,Appartement,50,3,,,,,,3.179024,50.704748
2021-955909,2021-01-28,000001,Vente,50000,27,,RUE D AVELGHEM,0350,59100,59512,Roubaix,59,,,59512000BK0068,,,,,,,,,,,,,0,1,Maison,90,5,S,sols,,,51,3.194036,50.694797
2021-955911,2021-01-27,000001,Vente,60000,199,,RUE DE L INDUSTRIE,2710,59100,59512,Roubaix,59,,,59512000KW0188,,,,,,,,,,,,,0,1,Maison,94,4,S,sols,,,81,3.16083,50.688937
2021-955917,2021-01-12,000001,Vente,400000,138,,RUE SAINT JEAN,5010,59100,59512,Roubaix,59,,,59512000HV0021,,,,,,,,,,,,,0,3,Dépendance,,0,S,sols,,,1370,3.18228,50.688052
2021-955917,2021-01-12,000001,Vente,400000,138,,RUE SAINT JEAN,5010,59100,59512,Roubaix,59,,,59512000HV0021,,,,,,,,,,,,,0,3,Dépendance,,0,S,sols,,,1370,3.18228,50.688052
2021-955917,2021-01-12,000001,Vente,400000,138,,RUE SAINT JEAN,5010,59100,59512,Roubaix,59,,,59512000HV0021,,,,,,,,,,,,,0,3,Dépendance,,0,S,sols,,,1370,3.18228,50.688052
2021-955917,2021-01-12,000001,Vente,400000,138,,RUE SAINT JEAN,5010,59100,59512,Roubaix,59,,,59512000HV0021,,,,,,,,,,,,,0,3,Dépendance,,0,S,sols,,,1370,3.18228,50.688052
2021-955917,2021-01-12,000001,Vente,400000,138,,RUE SAINT JEAN,5010,59100,59512,Roubaix,59,,,59512000HV0021,,,,,,,,,,,,,0,3,Dépendance,,0,S,sols,,,1370,3.18228,50.688052
2021-955917,2021-01-12,000001,Vente,400000,138,,RUE SAINT JEAN,5010,59100,59512,Roubaix,59,,,59512000HV0021,,,,,,,,,,,,,0,3,Dépendance,,0,S,sols,,,1370,3.18228,50.688052
2021-955917,2021-01-12,000001,Vente,400000,138,,RUE SAINT JEAN,5010,59100,59512,Roubaix,59,,,59512000HV0021,,,,,,,,,,,,,0,3,Dépendance,,0,S,sols,,,1370,3.18228,50.688052
2021-955917,2021-01-12,000001,Vente,400000,138,,RUE SAINT JEAN,5010,59100,59512,Roubaix,59,,,59512000HV0021,,,,,,,,,,,,,0,3,Dépendance,,0,S,sols,,,1370,3.18228,50.688052
2021-955917,2021-01-12,000001,Vente,400000,138,,RUE SAINT JEAN,5010,59100,59512,Roubaix,59,,,59512000HV0021,,,,,,,,,,,,,0,3,Dépendance,,0,S,sols,,,1370,3.18228,50.688052
2021-955917,2021-01-12,000001,Vente,400000,138,,RUE SAINT JEAN,5010,59100,59512,Roubaix,59,,,59512000HV0021,,,,,,,,,,,,,0,3,Dépendance,,0,S,sols,,,1370,3.18228,50.688052
2021-955917,2021-01-12,000001,Vente,400000,138,,RUE SAINT JEAN,5010,59100,59512,Roubaix,59,,,59512000HV0021,,,,,,,,,,,,,0,3,Dépendance,,0,S,sols,,,1370,3.18228,50.688052
2021-955917,2021-01-12,000001,Vente,400000,138,,RUE SAINT JEAN,5010,59100,59512,Roubaix,59,,,59512000HV0021,,,,,,,,,,,,,0,3,Dépendance,,0,S,sols,,,1370,3.18228,50.688052
2021-955917,2021-01-12,000001,Vente,400000,138,,RUE SAINT JEAN,5010,59100,59512,Roubaix,59,,,59512000HV0021,,,,,,,,,,,,,0,3,Dépendance,,0,S,sols,,,1370,3.18228,50.688052
2021-955917,2021-01-12,000001,Vente,400000,138,,RUE SAINT JEAN,5010,59100,59512,Roubaix,59,,,59512000HV0021,,,,,,,,,,,,,0,3,Dépendance,,0,S,sols,,,1370,3.18228,50.688052
2021-955917,2021-01-12,000001,Vente,400000,138,,RUE SAINT JEAN,5010,59100,59512,Roubaix,59,,,59512000HV0021,,,,,,,,,,,,,0,3,Dépendance,,0,S,sols,,,1370,3.18228,50.688052
2021-955917,2021-01-12,000001,Vente,400000,138,,RUE SAINT JEAN,5010,59100,59512,Roubaix,59,,,59512000HV0021,,,,,,,,,,,,,0,3,Dépendance,,0,S,sols,,,1370,3.18228,50.688052
2021-955917,2021-01-12,000001,Vente,400000,138,,RUE SAINT JEAN,5010,59100,59512,Roubaix,59,,,59512000HV0021,,,,,,,,,,,,,0,3,Dépendance,,0,S,sols,,,1370,3.18228,50.688052
2021-955917,2021-01-12,000001,Vente,400000,138,,RUE SAINT JEAN,5010,59100,59512,Roubaix,59,,,59512000HV0021,,,,,,,,,,,,,0,3,Dépendance,,0,S,sols,,,1370,3.18228,50.688052
2021-955917,2021-01-12,000001,Vente,400000,138,,RUE SAINT JEAN,5010,59100,59512,Roubaix,59,,,59512000HV0021,,,,,,,,,,,,,0,3,Dépendance,,0,S,sols,,,1370,3.18228,50.688052
2021-955917,2021-01-12,000001,Vente,400000,138,,RUE SAINT JEAN,5010,59100,59512,Roubaix,59,,,59512000HV0021,,,,,,,,,,,,,0,3,Dépendance,,0,S,sols,,,1370,3.18228,50.688052
2021-955917,2021-01-12,000001,Vente,400000,138,,RUE SAINT JEAN,5010,59100,59512,Roubaix,59,,,59512000HV0021,,,,,,,,,,,,,0,3,Dépendance,,0,S,sols,,,1370,3.18228,50.688052
2021-955917,2021-01-12,000001,Vente,400000,138,,RUE SAINT JEAN,5010,59100,59512,Roubaix,59,,,59512000HV0021,,,,,,,,,,,,,0,3,Dépendance,,0,S,sols,,,1370,3.18228,50.688052
2021-955917,2021-01-12,000001,Vente,400000,138,,RUE SAINT JEAN,5010,59100,59512,Roubaix,59,,,59512000HV0021,,,,,,,,,,,,,0,3,Dépendance,,0,S,sols,,,1370,3.18228,50.688052
2021-955917,2021-01-12,000001,Vente,400000,138,,RUE SAINT JEAN,5010,59100,59512,Roubaix,59,,,59512000HV0021,,,,,,,,,,,,,0,3,Dépendance,,0,S,sols,,,1370,3.18228,50.688052
2021-955917,2021-01-12,000001,Vente,400000,138,,RUE SAINT JEAN,5010,59100,59512,Roubaix,59,,,59512000HV0021,,,,,,,,,,,,,0,3,Dépendance,,0,S,sols,,,1370,3.18228,50.688052
2021-955917,2021-01-12,000001,Vente,400000,138,,RUE SAINT JEAN,5010,59100,59512,Roubaix,59,,,59512000HV0021,,,,,,,,,,,,,0,3,Dépendance,,0,S,sols,,,1370,3.18228,50.688052
2021-955917,2021-01-12,000001,Vente,400000,138,,RUE SAINT JEAN,5010,59100,59512,Roubaix,59,,,59512000HV0021,,,,,,,,,,,,,0,3,Dépendance,,0,S,sols,,,1370,3.18228,50.688052
2021-955917,2021-01-12,000001,Vente,400000,138,,RUE SAINT JEAN,5010,59100,59512,Roubaix,59,,,59512000HV0021,,,,,,,,,,,,,0,3,Dépendance,,0,S,sols,,,1370,3.18228,50.688052
2021-955917,2021-01-12,000001,Vente,400000,138,,RUE SAINT JEAN,5010,59100,59512,Roubaix,59,,,59512000HV0021,,,,,,,,,,,,,0,3,Dépendance,,0,S,sols,,,1370,3.18228,50.688052
2021-955917,2021-01-12,000001,Vente,400000,138,,RUE SAINT JEAN,5010,59100,59512,Roubaix,59,,,59512000HV0021,,,,,,,,,,,,,0,3,Dépendance,,0,S,sols,,,1370,3.18228,50.688052
2021-955917,2021-01-12,000001,Vente,400000,138,,RUE SAINT JEAN,5010,59100,59512,Roubaix,59,,,59512000HV0021,,,,,,,,,,,,,0,3,Dépendance,,0,S,sols,,,1370,3.18228,50.688052
2021-955917,2021-01-12,000001,Vente,400000,138,,RUE SAINT JEAN,5010,59100,59512,Roubaix,59,,,59512000HV0021,,,,,,,,,,,,,0,3,Dépendance,,0,S,sols,,,1370,3.18228,50.688052