id_mutation,date_mutation,numero_disposition,nature_mutation,valeur_fonciere,adresse_numero,adresse_suffixe,adresse_nom_voie,adresse_code_voie,code_postal,code_commune,nom_commune,code_departement,ancien_code_commune,ancien_nom_commune,id_parcelle,ancien_id_parcelle,numero_volume,lot1_numero,lot1_surface_carrez,lot2_numero,lot2_surface_carrez,lot3_numero,lot3_surface_carrez,lot4_numero,lot4_surface_carrez,lot5_numero,lot5_surface_carrez,nombre_lots,code_type_local,type_local,surface_reelle_bati,nombre_pieces_principales,code_nature_culture,nature_culture,code_nature_culture_speciale,nature_culture_speciale,surface_terrain,longitude,latitude
2021-984923,2021-04-27,000001,Vente,159300,,,AU LABOUREUR,B011,59173,59568,Sercus,59,,,59568000ZC0213,,,,,,,,,,,,,0,,,,,T,terres,,,772,2.443286,50.69656
2021-984923,2021-04-27,000001,Vente,159300,1594,,RUE TARTUS,0045,59173,59568,Sercus,59,,,59568000ZC0215,,,,,,,,,,,,,0,1,Maison,153,4,,,,,,2.443287,50.696531
2021-984923,2021-04-27,000001,Vente,159300,1594,,RUE TARTUS,0045,59173,59568,Sercus,59,,,59568000ZC0215,,,,,,,,,,,,,0,3,Dépendance,,0,,,,,,2.443287,50.696531
2021-984923,2021-04-27,000001,Vente,159300,1594,,RUE TARTUS,0045,59173,59568,Sercus,59,,,59568000ZC0215,,,,,,,,,,,,,0,3,Dépendance,,0,,,,,,2.443287,50.696531
2021-984937,2021-04-27,000001,Echange,11548,,,AU MOULIN,B015,59173,59568,Sercus,59,,,59568000ZD0187,,,,,,,,,,,,,0,,,,,T,terres,,,16497,2.452847,50.710196
2021-984938,2021-04-27,000002,Echange,20235,,,AU MOULIN,B015,59173,59568,Sercus,59,,,59568000ZD0246,,,,,,,,,,,,,0,,,,,T,terres,,,12410,2.450419,50.708026
2021-984938,2021-04-27,000002,Echange,20235,,,AU MOULIN,B015,59173,59568,Sercus,59,,,59568000ZD0247,,,,,,,,,,,,,0,,,,,T,terres,,,16497,2.450957,50.708355
2021-984939,2021-04-27,000003,Echange,8687,,,CLEENE LOO VELD,B004,59173,59568,Sercus,59,,,59568000ZC0027,,,,,,,,,,,,,0,,,,,T,terres,,,4890,2.444085,50.703304
2021-984939,2021-04-27,000003,Echange,8687,,,CLEENE LOO VELD,B004,59173,59568,Sercus,59,,,59568000ZC0028,,,,,,,,,,,,,0,,,,,T,terres,,,7520,2.44368,50.703152
2021-985589,2021-05-20,000001,Vente,155000,53,,CHE DE L EGLISE,0020,59173,59568,Sercus,59,,,595680000A0684,,,,,,,,,,,,,0,3,Dépendance,,0,S,sols,,,354,2.45553,50.705339
2021-985589,2021-05-20,000001,Vente,155000,53,,CHE DE L EGLISE,0020,59173,59568,Sercus,59,,,595680000A0684,,,,,,,,,,,,,0,1,Maison,130,5,S,sols,,,354,2.45553,50.705339
2021-986083,2021-06-18,000001,Vente,195000,78,,CTR DE L EGLISE,0019,59173,59568,Sercus,59,,,595680000A0915,,,,,,,,,,,,,0,3,Dépendance,,0,S,sols,,,1457,2.456205,50.705708
2021-986083,2021-06-18,000001,Vente,195000,78,,CTR DE L EGLISE,0019,59173,59568,Sercus,59,,,595680000A0915,,,,,,,,,,,,,0,3,Dépendance,,0,S,sols,,,1457,2.456205,50.705708
2021-986083,2021-06-18,000001,Vente,195000,78,,CTR DE L EGLISE,0019,59173,59568,Sercus,59,,,595680000A0915,,,,,,,,,,,,,0,1,Maison,162,6,S,sols,,,1457,2.456205,50.705708
2021-986618,2021-07-16,000001,Vente,30000,,,LES CLYTES,B005,59173,59568,Sercus,59,,,59568000ZA0061,,,,,,,,,,,,,0,,,,,T,terres,,,32810,2.463617,50.71221
2021-987002,2021-07-23,000001,Vente,130000,182,,CHE DE L EGLISE,0020,59173,59568,Sercus,59,,,59568000ZB0091,,,,,,,,,,,,,0,1,Maison,69,2,S,sols,,,486,2.454835,50.704365
2021-987002,2021-07-23,000001,Vente,130000,182,,CHE DE L EGLISE,0020,59173,59568,Sercus,59,,,59568000ZB0091,,,,,,,,,,,,,0,3,Dépendance,,0,S,sols,,,486,2.454835,50.704365
2021-987002,2021-07-23,000001,Vente,130000,182,,CHE DE L EGLISE,0020,59173,59568,Sercus,59,,,59568000ZB0092,,,,,,,,,,,,,0,,,,,S,sols,,,450,2.454614,50.704302
2021-987983,2021-09-21,000001,Vente,274800,,,RTE DE BLARINGHEM,0010,59173,59568,Sercus,59,,,59568000ZD0250,,,,,,,,,,,,,0,,,,,S,sols,,,206,2.450767,50.706738
2021-987983,2021-09-21,000001,Vente,274800,380,,RTE DE BLARINGHEM,0010,59173,59568,Sercus,59,,,59568000ZD0252,,,,,,,,,,,,,0,1,Maison,157,5,AG,terrains d'agrément,,,1451,2.45051,50.706607
2021-987983,2021-09-21,000001,Vente,274800,380,,RTE DE BLARINGHEM,0010,59173,59568,Sercus,59,,,59568000ZD0252,,,,,,,,,,,,,0,1,Maison,157,5,S,sols,,,543,2.45051,50.706607
2021-989781,2021-12-14,000002,Vente,487.5,,,LE VILLAGE,B023,59173,59568,Sercus,59,,,595680000A1071,,,,,,,,,,,,,0,,,,,T,terres,,,260,2.453134,50.704644
