id_mutation,date_mutation,numero_disposition,nature_mutation,valeur_fonciere,adresse_numero,adresse_suffixe,adresse_nom_voie,adresse_code_voie,code_postal,code_commune,nom_commune,code_departement,ancien_code_commune,ancien_nom_commune,id_parcelle,ancien_id_parcelle,numero_volume,lot1_numero,lot1_surface_carrez,lot2_numero,lot2_surface_carrez,lot3_numero,lot3_surface_carrez,lot4_numero,lot4_surface_carrez,lot5_numero,lot5_surface_carrez,nombre_lots,code_type_local,type_local,surface_reelle_bati,nombre_pieces_principales,code_nature_culture,nature_culture,code_nature_culture_speciale,nature_culture_speciale,surface_terrain,longitude,latitude
2021-983162,2021-01-04,000001,Vente,197100,1,A,RUE DE L EPINETTE,0070,59181,59581,Steenwerck,59,,,59581000XC0121,,,,,,,,,,,,,0,1,Maison,75,3,S,sols,,,240,2.791436,50.675748
2021-983264,2021-01-26,000002,Vente,132000,,,LE PACAU,B080,59181,59581,Steenwerck,59,,,59581000YO0119,,,,,,,,,,,,,0,,,,,T,terres,,,3820,2.766325,50.709247
2021-983272,2021-01-26,000002,Vente,15000,,,LE PACAU,B080,59181,59581,Steenwerck,59,,,59581000YO0126,,,,,,,,,,,,,0,,,,,T,terres,,,417,2.767311,50.708912
2021-983341,2021-01-21,000001,Vente,144000,6,,RUE DE LA PHILIPPOTERIE,0177,59181,59581,Steenwerck,59,,,59581000YM0067,,,,,,,,,,,,,0,1,Maison,120,3,S,sols,,,165,2.757764,50.704066
2021-983341,2021-01-21,000001,Vente,144000,6,,RUE DE LA PHILIPPOTERIE,0177,59181,59581,Steenwerck,59,,,59581000YM0067,,,,,,,,,,,,,0,1,Maison,120,3,J,jardins,POTAG,Jardin potager,1100,2.757764,50.704066
2021-983497,2021-01-11,000001,Vente,75000,5,B,RUE DE LA BOUDRELLE,0012,59181,59581,Steenwerck,59,,,59581000XE0152,,,,,,,,,,,,,0,,,,,AB,terrains a bâtir,,,700,2.772883,50.671764
2021-983508,2021-01-26,000001,Vente,205000,29,,RUE DU MUSEE,0166,59181,59581,Steenwerck,59,,,595810000E0301,,,,,,,,,,,,,0,3,Dépendance,,0,S,sols,,,261,2.772772,50.700432
2021-983508,2021-01-26,000001,Vente,205000,29,,RUE DU MUSEE,0166,59181,59581,Steenwerck,59,,,595810000E0301,,,,,,,,,,,,,0,1,Maison,70,5,S,sols,,,261,2.772772,50.700432
2021-983587,2021-02-02,000001,Vente,217200,57,,RUE DU MORTIER,0155,59181,59581,Steenwerck,59,,,59581000XN0092,,,,,,,,,,,,,0,,,,,T,terres,,,3285,2.756639,50.686393
2021-983587,2021-02-02,000001,Vente,217200,57,,RUE DU MORTIER,0155,59181,59581,Steenwerck,59,,,59581000XN0093,,,,,,,,,,,,,0,,,,,T,terres,,,4179,2.756938,50.685435
2021-983694,2021-02-15,000001,Vente,575800,,,RUE DU SAULE,0220,59181,59581,Steenwerck,59,,,59581000YO0153,,,,,,,,,,,,,0,,,,,AB,terrains a bâtir,,,483,2.768659,50.704714
2021-983694,2021-02-15,000001,Vente,575800,615,,RUE DU SAULE,0220,59181,59581,Steenwerck,59,,,59581000YO0154,,,,,,,,,,,,,0,1,Maison,161,5,S,sols,,,480,2.768423,50.704744
2021-983866,2021-02-16,000001,Vente,240000,15,,RUE DU SEQUENTEAU,0230,59181,59581,Steenwerck,59,,,59581000XA0064,,,,,,,,,,,,,0,1,Maison,100,4,S,sols,,,535,2.784324,50.67976
2021-983866,2021-02-16,000001,Vente,240000,15,,RUE DU SEQUENTEAU,0230,59181,59581,Steenwerck,59,,,59581000XA0064,,,,,,,,,,,,,0,1,Maison,70,3,S,sols,,,535,2.784324,50.67976
2021-983866,2021-02-16,000001,Vente,240000,15,,RUE DU SEQUENTEAU,0230,59181,59581,Steenwerck,59,,,59581000XA0064,,,,,,,,,,,,,0,3,Dépendance,,0,S,sols,,,535,2.784324,50.67976
2021-983998,2021-02-19,000002,Vente,65000,1,,RUE DES CLINQUES,0022,59181,59581,Steenwerck,59,,,59581000XL0063,,,,,,,,,,,,,0,1,Maison,56,2,,,,,,2.733901,50.681777
2021-983998,2021-02-19,000002,Vente,65000,1,,RUE DES CLINQUES,0022,59181,59581,Steenwerck,59,,,59581000XL0063,,,,,,,,,,,,,0,1,Maison,170,7,,,,,,2.733901,50.681777
2021-983998,2021-02-19,000002,Vente,65000,1,,RUE DES CLINQUES,0022,59181,59581,Steenwerck,59,,,59581000XL0063,,,,,,,,,,,,,0,3,Dépendance,,0,,,,,,2.733901,50.681777
2021-984144,2021-03-04,000001,Vente,350000,3,,RUE DU PONT VANUXEEM,0172,59181,59581,Steenwerck,59,,,59581000XA0015,,,,,,,,,,,,,0,3,Dépendance,,0,T,terres,,,32050,2.775087,50.683897
2021-984144,2021-03-04,000001,Vente,350000,3,,RUE DU PONT VANUXEEM,0172,59181,59581,Steenwerck,59,,,59581000XA0015,,,,,,,,,,,,,0,1,Maison,130,6,S,sols,,,3500,2.775087,50.683897
2021-984144,2021-03-04,000001,Vente,350000,3,,RUE DU PONT VANUXEEM,0172,59181,59581,Steenwerck,59,,,59581000XA0015,,,,,,,,,,,,,0,1,Maison,130,6,T,terres,,,32050,2.775087,50.683897
2021-984144,2021-03-04,000001,Vente,350000,3,,RUE DU PONT VANUXEEM,0172,59181,59581,Steenwerck,59,,,59581000XA0015,,,,,,,,,,,,,0,3,Dépendance,,0,S,sols,,,3500,2.775087,50.683897
2021-984243,2021-03-23,000001,Vente,290000,5,,RUE DU MORTIER,0155,59181,59581,Steenwerck,59,,,595810000E0330,,,,,,,,,,,,,0,4,Local industriel. commercial ou assimilé,96,0,S,sols,,,97,2.774712,50.700533
2021-984243,2021-03-23,000001,Vente,290000,5,,RUE DU MORTIER,0155,59181,59581,Steenwerck,59,,,595810000E0330,,,,,,,,,,,,,0,2,Appartement,60,3,S,sols,,,97,2.774712,50.700533
2021-984243,2021-03-23,000001,Vente,290000,5,,RUE DU MORTIER,0155,59181,59581,Steenwerck,59,,,595810000E0330,,,,,,,,,,,,,0,2,Appartement,60,2,S,sols,,,97,2.774712,50.700533
2021-984243,2021-03-23,000001,Vente,290000,,,RUE DU MORTIER,0155,59181,59581,Steenwerck,59,,,595810000E0331,,,,,,,,,,,,,0,,,,,S,sols,,,42,2.774717,50.700568
2021-984392,2021-03-16,000001,Vente,4580,,,EN FACE LA CHAUMIERE,B142,59181,59581,Steenwerck,59,,,59581000XC0047,,,,,,,,,,,,,0,,,,,AB,terrains a bâtir,CHEM,Chemin (non groupe),2290,2.794364,50.67596
2021-984393,2021-03-16,000002,Vente,908,,,RUE DE LE DOULIEU,0040,59181,59581,Steenwerck,59,,,59581000YL0092,,,,,,,,,,,,,0,,,,,T,terres,,,454,2.745252,50.697333
2021-984738,2021-04-14,000001,Vente,2196,,,MOULIN A L HUILE,B073,59181,59581,Steenwerck,59,,,59581000XI0035,,,,,,,,,,,,,0,,,,,P,prés,,,2440,2.765871,50.661657
2021-985174,2021-05-10,000001,Vente,249000,18,,RUE DU BAC ST MAUR,0002,59181,59581,Steenwerck,59,,,595810000B0427,,,,,,,,,,,,,0,1,Maison,160,7,S,sols,,,326,2.791697,50.674725
2021-985312,2021-05-19,000001,Vente,57000,1,,RUE DE L EPINETTE,0070,59181,59581,Steenwerck,59,,,59581000XC0135,,,,,,,,,,,,,0,,,,,AB,terrains a bâtir,,,283,2.791355,50.675654
2021-985379,2021-05-07,000001,Vente,147300,,,VOIE FELIX LEBLEU,B136,59181,59581,Steenwerck,59,,,59581000XH0112,,,,,,,,,,,,,0,,,,,J,jardins,POTAG,Jardin potager,134,2.787659,50.677757
2021-985379,2021-05-07,000001,Vente,147300,10,,RUE DU SEQUENTEAU,0230,59181,59581,Steenwerck,59,,,59581000XH0114,,,,,,,,,,,,,0,1,Maison,80,4,S,sols,,,84,2.787813,50.67783
2021-985431,2021-05-07,000001,Vente,133500,1,,RUE DE PYPE,0176,59181,59581,Steenwerck,59,,,59581000XE0142,,,,,,,,,,,,,0,1,Maison,54,3,S,sols,,,161,2.78789,50.67249
2021-985625,2021-05-27,000001,Vente,10000,,,LA FERME TRAISNEL,B140,59181,59581,Steenwerck,59,,,59581000XE0025,,,,,,,,,,,,,0,,,,,T,terres,,,9170,2.774405,50.670583
2021-985639,2021-05-12,000001,Vente,229200,37,,RUE DU MUSEE,0166,59181,59581,Steenwerck,59,,,595810000E0757,,,,,,,,,,,,,0,1,Maison,107,5,S,sols,,,212,2.772184,50.700152
2021-985713,2021-06-01,000001,Vente,8300,,,LA STATION,B115,59181,59581,Steenwerck,59,,,59581000YP0310,,,,,,,,,,,,,0,,,,,T,terres,,,88,2.784862,50.711796
2021-986038,2021-05-28,000001,Vente,540000,5005,F,RUE DU MORTIER,0155,59181,59581,Steenwerck,59,,,59581000XN0087,,,,,,,,,,,,,0,4,Local industriel. commercial ou assimilé,11096,0,S,sols,,,11918,2.761483,50.687423
2021-986114,2021-06-08,000001,Vente,110000,10,,RUE DE LA LYS,0149,59181,59581,Steenwerck,59,,,595810000B0495,,,,,,,,,,,,,0,3,Dépendance,,0,S,sols,,,297,2.790039,50.674499
2021-986114,2021-06-08,000001,Vente,110000,10,,RUE DE LA LYS,0149,59181,59581,Steenwerck,59,,,595810000B0495,,,,,,,,,,,,,0,1,Maison,48,4,S,sols,,,297,2.790039,50.674499
2021-986114,2021-06-08,000001,Vente,110000,10,,RUE DE LA LYS,0149,59181,59581,Steenwerck,59,,,595810000B0495,,,,,,,,,,,,,0,3,Dépendance,,0,S,sols,,,297,2.790039,50.674499
2021-986114,2021-06-08,000001,Vente,110000,,,RUE DE LA LYS,0149,59181,59581,Steenwerck,59,,,595810000B1168,,,,,,,,,,,,,0,,,,,S,sols,,,36,2.789911,50.674421
2021-986119,2021-06-23,000001,Vente,20000,23,,RUE DE LA LYS,0149,59181,59581,Steenwerck,59,,,59581000XH0137,,,,,,,,,,,,,0,1,Maison,57,3,S,sols,,,140,2.788763,50.673946
2021-986119,2021-06-23,000001,Vente,20000,23,,RUE DE LA LYS,0149,59181,59581,Steenwerck,59,,,59581000XH0166,,,,,,,,,,,,,0,,,,,S,sols,,,57,2.788521,50.674076
2021-986206,2021-06-24,000001,Vente,115000,24,,RESIDENCE JARDIN DEBERT,0145,59181,59581,Steenwerck,59,,,59581000YN0200,,,,,,,,,,,,,0,1,Maison,48,2,S,sols,,,223,2.770776,50.70193
2021-986413,2021-06-15,000001,Vente,9636,,,LA LONGUE RUELLE,B066,59181,59581,Steenwerck,59,,,59581000YM0119,,,,,,,,,,,,,0,,,,,T,terres,,,3889,2.763252,50.699726
2021-986531,2021-07-15,000001,Vente,272000,7,,RUE DU PONT DE PIERRE,0170,59181,59581,Steenwerck,59,,,59581000YO0115,,,,,,,,,,,,,0,1,Maison,132,2,AG,terrains d'agrément,JARD,Jardin d'agrément,1086,2.767652,50.711818
2021-986531,2021-07-15,000001,Vente,272000,7,,RUE DU PONT DE PIERRE,0170,59181,59581,Steenwerck,59,,,59581000YO0115,,,,,,,,,,,,,0,1,Maison,132,2,BP,peupleraies,,,8000,2.767652,50.711818
2021-986531,2021-07-15,000001,Vente,272000,7,,RUE DU PONT DE PIERRE,0170,59181,59581,Steenwerck,59,,,59581000YO0115,,,,,,,,,,,,,0,1,Maison,132,2,PA,pâtures,,,2330,2.767652,50.711818
2021-986531,2021-07-15,000001,Vente,272000,7,,RUE DU PONT DE PIERRE,0170,59181,59581,Steenwerck,59,,,59581000YO0115,,,,,,,,,,,,,0,1,Maison,132,2,S,sols,,,623,2.767652,50.711818
2021-986531,2021-07-15,000001,Vente,272000,7,,RUE DU PONT DE PIERRE,0170,59181,59581,Steenwerck,59,,,59581000YO0115,,,,,,,,,,,,,0,1,Maison,132,2,J,jardins,POTAG,Jardin potager,79,2.767652,50.711818
2021-986582,2021-06-30,000001,Vente,308000,5,,RESIDENCE LA SERPENTINE,0233,59181,59581,Steenwerck,59,,,59581000YN0288,,,,,,,,,,,,,0,1,Maison,116,6,S,sols,,,431,2.769995,50.70319
2021-986652,2021-07-02,000001,Vente,254150,27,D,RUE DE LA GARE,0100,59181,59581,Steenwerck,59,,,59581000YP0197,,,,,,,,,,,,,0,3,Dépendance,,0,S,sols,,,399,2.780446,50.704072
2021-986652,2021-07-02,000001,Vente,254150,27,D,RUE DE LA GARE,0100,59181,59581,Steenwerck,59,,,59581000YP0197,,,,,,,,,,,,,0,1,Maison,119,5,S,sols,,,399,2.780446,50.704072
2021-986766,2021-07-02,000001,Vente,120000,17,,RUE DU PONT D ACHELLES,0168,59181,59581,Steenwerck,59,,,59581000YV0061,,,,,,,,,,,,,0,3,Dépendance,,0,S,sols,,,117,2.787457,50.700113
2021-986766,2021-07-02,000001,Vente,120000,17,,RUE DU PONT D ACHELLES,0168,59181,59581,Steenwerck,59,,,59581000YV0061,,,,,,,,,,,,,0,3,Dépendance,,0,J,jardins,POTAG,Jardin potager,455,2.787457,50.700113
2021-986766,2021-07-02,000001,Vente,120000,17,,RUE DU PONT D ACHELLES,0168,59181,59581,Steenwerck,59,,,59581000YV0061,,,,,,,,,,,,,0,1,Maison,40,2,J,jardins,POTAG,Jardin potager,455,2.787457,50.700113
2021-986766,2021-07-02,000001,Vente,120000,17,,RUE DU PONT D ACHELLES,0168,59181,59581,Steenwerck,59,,,59581000YV0061,,,,,,,,,,,,,0,1,Maison,40,2,S,sols,,,117,2.787457,50.700113
2021-986954,2021-07-13,000001,Vente,495800,,,RUE DU FUNQUEREAU,0095,59181,59581,Steenwerck,59,,,59581000XK0001,,,,,,,,,,,,,0,,,,,T,terres,,,5210,2.749588,50.668724
2021-986954,2021-07-13,000001,Vente,495800,2,,RUE DE LA QUENEQUE,0178,59181,59581,Steenwerck,59,,,59581000XK0057,,,,,,,,,,,,,0,1,Maison,126,6,S,sols,,,1381,2.749261,50.669061
2021-987035,2021-07-15,000001,Vente,173000,5,,RUE DE LA GARE,0100,59181,59581,Steenwerck,59,,,595810000E0034,,,,,,,,,,,,,0,1,Maison,138,4,S,sols,,,391,2.779359,50.702124
2021-987086,2021-07-23,000001,Vente,312000,64,,RUE DE LA GARE,0100,59181,59581,Steenwerck,59,,,59581000YP0243,,,,,,,,,,,,,0,3,Dépendance,,0,S,sols,,,273,2.785241,50.711858
2021-987086,2021-07-23,000001,Vente,312000,64,,RUE DE LA GARE,0100,59181,59581,Steenwerck,59,,,59581000YP0243,,,,,,,,,,,,,0,3,Dépendance,,0,S,sols,,,273,2.785241,50.711858
2021-987086,2021-07-23,000001,Vente,312000,64,,RUE DE LA GARE,0100,59181,59581,Steenwerck,59,,,59581000YP0243,,,,,,,,,,,,,0,3,Dépendance,,0,S,sols,,,273,2.785241,50.711858
2021-987086,2021-07-23,000001,Vente,312000,64,,RUE DE LA GARE,0100,59181,59581,Steenwerck,59,,,59581000YP0243,,,,,,,,,,,,,0,1,Maison,76,4,S,sols,,,273,2.785241,50.711858
2021-987086,2021-07-23,000001,Vente,312000,,,LA STATION,B115,59181,59581,Steenwerck,59,,,59581000YP0307,,,,,,,,,,,,,0,,,,,AG,terrains d'agrément,JARD,Jardin d'agrément,420,2.785168,50.711879
2021-987277,2021-07-23,000001,Vente,345000,11,,RUE DE LA LYS,0149,59181,59581,Steenwerck,59,,,595810000B0961,,,,,,,,,,,,,0,1,Maison,116,4,S,sols,,,320,2.789708,50.674761
2021-987277,2021-07-23,000001,Vente,345000,11,,RUE DE LA LYS,0149,59181,59581,Steenwerck,59,,,595810000B0961,,,,,,,,,,,,,0,3,Dépendance,,0,S,sols,,,320,2.789708,50.674761
2021-987277,2021-07-23,000001,Vente,345000,11,,RUE DE LA LYS,0149,59181,59581,Steenwerck,59,,,595810000B0961,,,,,,,,,,,,,0,3,Dépendance,,0,S,sols,,,320,2.789708,50.674761
2021-987277,2021-07-23,000001,Vente,345000,,,RUE DE LA LYS,0149,59181,59581,Steenwerck,59,,,595810000B1154,,,,,,,,,,,,,0,,,,,S,sols,,,261,2.789488,50.674994
2021-987277,2021-07-23,000001,Vente,345000,,,RUE DE LA LYS,0149,59181,59581,Steenwerck,59,,,595810000B1157,,,,,,,,,,,,,0,,,,,S,sols,,,755,2.78962,50.674793
2021-987286,2021-07-23,000001,Vente,200000,78,,RUE DE LA GARE,0100,59181,59581,Steenwerck,59,,,59581000YP0141,,,,,,,,,,,,,0,1,Maison,67,4,S,sols,,,202,2.78634,50.712401
2021-987415,2021-08-04,000001,Vente,400000,57,,RUE DU MORTIER,0155,59181,59581,Steenwerck,59,,,59581000XN0091,,,,,,,,,,,,,0,4,Local industriel. commercial ou assimilé,684,0,S,sols,,,4237,2.757497,50.686014
2021-987501,2021-08-11,000001,Vente,243800,10,,RUE DU TILLEUL DAUCHY,0270,59181,59581,Steenwerck,59,,,59581000YW0077,,,,,,,,,,,,,0,1,Maison,137,5,J,jardins,POTAG,Jardin potager,393,2.762341,50.697447
2021-987501,2021-08-11,000001,Vente,243800,10,,RUE DU TILLEUL DAUCHY,0270,59181,59581,Steenwerck,59,,,59581000YW0077,,,,,,,,,,,,,0,1,Maison,137,5,S,sols,,,538,2.762341,50.697447
2021-987567,2021-08-09,000001,Vente,100000,6127,,RUE DU MORTIER,0155,59181,59581,Steenwerck,59,,,59581000XN0035,,,,,,,,,,,,,0,4,Local industriel. commercial ou assimilé,150,0,S,sols,,,2487,2.762276,50.689681
2021-987920,2021-09-13,000001,Vente,125000,26,,RUE DE LA RABETTE,0180,59181,59581,Steenwerck,59,,,595810000E0619,,,,,,,,,,,,,0,,,,,S,sols,,,5,2.781662,50.699202
2021-987920,2021-09-13,000001,Vente,125000,26,,RUE DE LA RABETTE,0180,59181,59581,Steenwerck,59,,,595810000E0620,,,,,,,,,,,,,0,3,Dépendance,,0,S,sols,,,143,2.781523,50.699224
2021-987920,2021-09-13,000001,Vente,125000,26,,RUE DE LA RABETTE,0180,59181,59581,Steenwerck,59,,,595810000E0620,,,,,,,,,,,,,0,1,Maison,104,4,S,sols,,,143,2.781523,50.699224
2021-987920,2021-09-13,000001,Vente,125000,26,,RUE DE LA RABETTE,0180,59181,59581,Steenwerck,59,,,595810000E0621,,,,,,,,,,,,,0,,,,,S,sols,,,99,2.781371,50.699242
2021-988275,2021-09-10,000001,Vente,177500,4,,RUE DE LA RABETTE,0180,59181,59581,Steenwerck,59,,,595810000E0825,,,,,,,,,,,,,0,3,Dépendance,,0,S,sols,,,223,2.780747,50.698666
2021-988275,2021-09-10,000001,Vente,177500,4,,RUE DE LA RABETTE,0180,59181,59581,Steenwerck,59,,,595810000E0825,,,,,,,,,,,,,0,1,Maison,87,4,S,sols,,,223,2.780747,50.698666
2021-988275,2021-09-10,000001,Vente,177500,4,,RUE DE LA RABETTE,0180,59181,59581,Steenwerck,59,,,595810000E0828,,,,,,,,,,,,,0,,,,,S,sols,,,5,2.780582,50.698727
2021-988392,2021-09-28,000001,Vente,120000,6,,GRAND CHEMIN,0125,59181,59581,Steenwerck,59,,,59581000XN0096,,,,,,,,,,,,,0,3,Dépendance,,0,S,sols,,,1950,2.756802,50.693858
2021-988392,2021-09-28,000001,Vente,120000,6,,GRAND CHEMIN,0125,59181,59581,Steenwerck,59,,,59581000XN0096,,,,,,,,,,,,,0,1,Maison,102,6,S,sols,,,1950,2.756802,50.693858
2021-988392,2021-09-28,000001,Vente,120000,,,LE KIRLEM,B065,59181,59581,Steenwerck,59,,,59581000XN0098,,,,,,,,,,,,,0,,,,,PA,pâtures,,,2848,2.757035,50.694119
2021-988421,2021-10-06,000001,Vente,1000,,,PONT D EUS,B084,59181,59581,Steenwerck,59,,,59581000XI0078,,,,,,,,,,,,,0,,,,,PA,pâtures,,,1965,2.765848,50.66501
2021-988447,2021-10-18,000001,Vente,213500,955,,RUE DU SAULE,0220,59181,59581,Steenwerck,59,,,59581000YO0109,,,,,,,,,,,,,0,3,Dépendance,,0,S,sols,,,385,2.765448,50.705732
2021-988447,2021-10-18,000001,Vente,213500,955,,RUE DU SAULE,0220,59181,59581,Steenwerck,59,,,59581000YO0109,,,,,,,,,,,,,0,3,Dépendance,,0,S,sols,,,385,2.765448,50.705732
2021-988447,2021-10-18,000001,Vente,213500,955,,RUE DU SAULE,0220,59181,59581,Steenwerck,59,,,59581000YO0109,,,,,,,,,,,,,0,1,Maison,112,5,S,sols,,,385,2.765448,50.705732
2021-988447,2021-10-18,000001,Vente,213500,955,,RUE DU SAULE,0220,59181,59581,Steenwerck,59,,,59581000YO0109,,,,,,,,,,,,,0,3,Dépendance,,0,S,sols,,,385,2.765448,50.705732
2021-988541,2021-10-18,000001,Vente,248000,30,,RUE DU BAC ST MAUR,0002,59181,59581,Steenwerck,59,,,59581000XC0076,,,,,,,,,,,,,0,1,Maison,80,3,S,sols,,,283,2.793911,50.672593
2021-988541,2021-10-18,000001,Vente,248000,28,B,RUE DU BAC ST MAUR,0002,59181,59581,Steenwerck,59,,,59581000XC0077,,,,,,,,,,,,,0,3,Dépendance,,0,S,sols,,,878,2.793896,50.672669
2021-988679,2021-10-22,000001,Vente,175000,54,,RUE DU MUSEE,0166,59181,59581,Steenwerck,59,,,59581000ZE0310,,,,,,,,,,,,,0,1,Maison,94,5,S,sols,,,364,2.769797,50.699117
2021-988742,2021-10-04,000001,Vente,444200,124,,RUE DU BAC ST MAUR,0002,59181,59581,Steenwerck,59,,,59581000XC0123,,,,,,,,,,,,,0,1,Maison,181,5,S,sols,,,1138,2.792034,50.674551
2021-988958,2021-10-20,000001,Vente,25592,,,VOIE DES PAUVRES,B133,59181,59581,Steenwerck,59,,,59581000XM0003,,,,,,,,,,,,,0,,,,,T,terres,,,31960,2.755367,50.684719
2021-988958,2021-10-20,000001,Vente,25592,,,VOIE DES PAUVRES,B133,59181,59581,Steenwerck,59,,,59581000XM0004,,,,,,,,,,,,,0,,,,,T,terres,,,4600,2.751925,50.683896
2021-989265,2021-11-10,000001,Vente,198500,14,,RUE DE L HEYSTRAETE,0144,59181,59581,Steenwerck,59,,,59581000YT0079,,,,,,,,,,,,,0,1,Maison,60,5,J,jardins,POTAG,Jardin potager,80,2.796661,50.688995
2021-989265,2021-11-10,000001,Vente,198500,14,,RUE DE L HEYSTRAETE,0144,59181,59581,Steenwerck,59,,,59581000YT0079,,,,,,,,,,,,,0,1,Maison,60,5,S,sols,,,638,2.796661,50.688995
2021-989265,2021-11-10,000001,Vente,198500,14,,RUE DE L HEYSTRAETE,0144,59181,59581,Steenwerck,59,,,59581000YT0079,,,,,,,,,,,,,0,3,Dépendance,,0,S,sols,,,638,2.796661,50.688995
2021-989265,2021-11-10,000001,Vente,198500,14,,RUE DE L HEYSTRAETE,0144,59181,59581,Steenwerck,59,,,59581000YT0079,,,,,,,,,,,,,0,3,Dépendance,,0,J,jardins,POTAG,Jardin potager,80,2.796661,50.688995
2021-989456,2021-11-25,000001,Vente,100000,,,LE KIRLEM,B065,59181,59581,Steenwerck,59,,,59581000XN0003,,,,,,,,,,,,,0,,,,,T,terres,,,10510,2.763189,50.691651
2021-989456,2021-11-25,000001,Vente,100000,,,LE KIRLEM,B065,59181,59581,Steenwerck,59,,,59581000XN0100,,,,,,,,,,,,,0,,,,,T,terres,,,25380,2.762458,50.69072
2021-989623,2021-12-14,000001,Vente,230000,31,,RUE DU MUSEE,0166,59181,59581,Steenwerck,59,,,595810000E1145,,,,,,,,,,,,,0,,,,,S,sols,,,176,2.772644,50.700551
2021-989623,2021-12-14,000001,Vente,230000,31,,RUE DU MUSEE,0166,59181,59581,Steenwerck,59,,,595810000E1146,,,,,,,,,,,,,0,3,Dépendance,,0,S,sols,,,110,2.772745,50.700312
2021-989623,2021-12-14,000001,Vente,230000,31,,RUE DU MUSEE,0166,59181,59581,Steenwerck,59,,,595810000E1146,,,,,,,,,,,,,0,1,Maison,182,6,S,sols,,,110,2.772745,50.700312
2021-989623,2021-12-14,000001,Vente,230000,,,RUE DU MUSEE,0166,59181,59581,Steenwerck,59,,,595810000E1147,,,,,,,,,,,,,0,,,,,S,sols,,,109,2.772683,50.700248
2021-989623,2021-12-14,000001,Vente,230000,,,RUE DU MUSEE,0166,59181,59581,Steenwerck,59,,,595810000E1148,,,,,,,,,,,,,0,,,,,S,sols,,,24,2.772619,50.700369
2021-990130,2021-12-23,000001,Vente,140000,32,,RUE DE LA GARE,0100,59181,59581,Steenwerck,59,,,59581000YP0106,,,,,,,,,,,,,0,,,,,S,sols,,,97,2.779674,50.704036
2021-990130,2021-12-23,000001,Vente,140000,32,,RUE DE LA GARE,0100,59181,59581,Steenwerck,59,,,59581000YP0107,,,,,,,,,,,,,0,1,Maison,88,4,S,sols,,,60,2.779882,50.703983
2021-990130,2021-12-23,000001,Vente,140000,32,,RUE DE LA GARE,0100,59181,59581,Steenwerck,59,,,59581000YP0107,,,,,,,,,,,,,0,3,Dépendance,,0,S,sols,,,60,2.779882,50.703983
2021-990133,2021-12-14,000001,Vente,280000,2,,RUE DE NIEPPE,0160,59181,59581,Steenwerck,59,,,595810000E0942,,,,,,,,,,,,,0,4,Local industriel. commercial ou assimilé,150,0,S,sols,,,810,2.778832,50.701563
2021-990297,2021-12-28,000001,Vente,157000,31,,RUE DU PONT D ACHELLES,0168,59181,59581,Steenwerck,59,,,59581000YV0053,,,,,,,,,,,,,0,3,Dépendance,,0,S,sols,,,413,2.789503,50.699847
2021-990297,2021-12-28,000001,Vente,157000,31,,RUE DU PONT D ACHELLES,0168,59181,59581,Steenwerck,59,,,59581000YV0053,,,,,,,,,,,,,0,1,Maison,80,4,S,sols,,,413,2.789503,50.699847
2021-990480,2021-12-24,000001,Vente,147000,51,,RUE DE LA RABETTE,0180,59181,59581,Steenwerck,59,,,595810000E0891,,,,,,,,,,,,,0,3,Dépendance,,0,S,sols,,,207,2.782446,50.69964
2021-990480,2021-12-24,000001,Vente,147000,51,,RUE DE LA RABETTE,0180,59181,59581,Steenwerck,59,,,595810000E0891,,,,,,,,,,,,,0,1,Maison,62,4,S,sols,,,207,2.782446,50.69964
2021-990480,2021-12-24,000001,Vente,147000,51,,RUE DE LA RABETTE,0180,59181,59581,Steenwerck,59,,,595810000E0891,,,,,,,,,,,,,0,3,Dépendance,,0,S,sols,,,207,2.782446,50.69964
2021-990480,2021-12-24,000001,Vente,147000,51,,RUE DE LA RABETTE,0180,59181,59581,Steenwerck,59,,,595810000E0891,,,,,,,,,,,,,0,3,Dépendance,,0,S,sols,,,207,2.782446,50.69964
