id_mutation,date_mutation,numero_disposition,nature_mutation,valeur_fonciere,adresse_numero,adresse_suffixe,adresse_nom_voie,adresse_code_voie,code_postal,code_commune,nom_commune,code_departement,ancien_code_commune,ancien_nom_commune,id_parcelle,ancien_id_parcelle,numero_volume,lot1_numero,lot1_surface_carrez,lot2_numero,lot2_surface_carrez,lot3_numero,lot3_surface_carrez,lot4_numero,lot4_surface_carrez,lot5_numero,lot5_surface_carrez,nombre_lots,code_type_local,type_local,surface_reelle_bati,nombre_pieces_principales,code_nature_culture,nature_culture,code_nature_culture_speciale,nature_culture_speciale,surface_terrain,longitude,latitude
2021-1007795,2021-03-13,000001,Vente,213000,,,LE VILLAGE,B046,60420,60158,Coivrel,60,,,601580000B0576,,,,,,,,,,,,,0,,,,,P,prés,,,631,2.557581,49.552867
2021-1007795,2021-03-13,000001,Vente,213000,37,,GR GRANDE RUE,0003,60420,60158,Coivrel,60,,,601580000B0577,,,,,,,,,,,,,0,1,Maison,90,5,S,sols,,,545,2.556884,49.552848
2021-1008826,2021-05-05,000001,Vente,200000,,,LE VILLAGE,B046,60420,60158,Coivrel,60,,,601580000B0810,,,,,,,,,,,,,0,,,,,J,jardins,,,792,2.553397,49.55408
2021-1008826,2021-05-05,000001,Vente,200000,16,,GR GRANDE RUE,0003,60420,60158,Coivrel,60,,,601580000B0896,,,,,,,,,,,,,0,1,Maison,125,5,S,sols,,,690,2.553469,49.554519
2021-1008834,2021-05-05,000001,Vente,132500,,,LE SANTERRE,B042,60420,60158,Coivrel,60,,,60158000ZH0016,,,,,,,,,,,,,0,,,,,T,terres,,,1567,2.558832,49.560426
2021-1008834,2021-05-05,000001,Vente,132500,,,LE SANTERRE,B042,60420,60158,Coivrel,60,,,60158000ZH0016,,,,,,,,,,,,,0,,,,,T,terres,,,783,2.558832,49.560426
2021-1008834,2021-05-05,000001,Vente,132500,,,LE PETIT TERROIR,B034,60420,60158,Coivrel,60,,,60158000ZO0002,,,,,,,,,,,,,0,,,,,T,terres,,,64470,2.537734,49.567561
2021-1009136,2021-05-27,000001,Vente,900,,,LES PRES DU MOULIN A HUILE,B039,60420,60158,Coivrel,60,,,601580000B0325,,,,,,,,,,,,,0,,,,,P,prés,,,1085,2.562546,49.55421
2021-1009136,2021-05-27,000001,Vente,900,,,LE VILLAGE,B046,60420,60158,Coivrel,60,,,601580000B0684,,,,,,,,,,,,,0,,,,,P,prés,,,790,2.554996,49.548517
2021-1012642,2021-10-26,000001,Vente,80000,,,LE VILLAGE,B046,60420,60158,Coivrel,60,,,601580000B0509,,,,,,,,,,,,,0,,,,,J,jardins,,,1418,2.553526,49.55512
2021-1012642,2021-10-26,000001,Vente,80000,13,,GR GRANDE RUE,0003,60420,60158,Coivrel,60,,,601580000B0510,,,,,,,,,,,,,0,1,Maison,69,3,S,sols,,,302,2.553327,49.554899
2021-1012642,2021-10-26,000001,Vente,80000,13,,GR GRANDE RUE,0003,60420,60158,Coivrel,60,,,601580000B0510,,,,,,,,,,,,,0,3,Dépendance,,0,S,sols,,,302,2.553327,49.554899
2021-1012658,2021-10-30,000001,Vente,5200,,,LA CAMPAGNE,B009,60420,60158,Coivrel,60,,,60158000ZI0002,,,,,,,,,,,,,0,,,,,T,terres,,,8520,2.564356,49.556651
2021-1012732,2021-10-23,000001,Vente,168000,18,,RUE DES BATTES,0001,60420,60158,Coivrel,60,,,601580000B0619,,,,,,,,,,,,,0,3,Dépendance,,0,S,sols,,,451,2.560095,49.551474
2021-1012732,2021-10-23,000001,Vente,168000,18,,RUE DES BATTES,0001,60420,60158,Coivrel,60,,,601580000B0619,,,,,,,,,,,,,0,1,Maison,100,5,S,sols,,,451,2.560095,49.551474
2021-1012732,2021-10-23,000001,Vente,168000,18,,RUE DES BATTES,0001,60420,60158,Coivrel,60,,,601580000B0619,,,,,,,,,,,,,0,3,Dépendance,,0,S,sols,,,451,2.560095,49.551474
2021-1013644,2021-12-09,000001,Vente,45000,,,LE VILLAGE,B046,60420,60158,Coivrel,60,,,601580000B0596,,,,,,,,,,,,,0,,,,,S,sols,,,322,2.560039,49.551808
2021-1013644,2021-12-09,000001,Vente,45000,,,LE VILLAGE,B046,60420,60158,Coivrel,60,,,601580000B0597,,,,,,,,,,,,,0,,,,,J,jardins,,,1350,2.560276,49.552154
2021-1013644,2021-12-09,000001,Vente,45000,,,LE VILLAGE,B046,60420,60158,Coivrel,60,,,601580000B0599,,,,,,,,,,,,,0,,,,,P,prés,,,500,2.560739,49.552378
2021-1014061,2021-12-17,000001,Vente,1071,,,LE CHATELET,B010,60420,60158,Coivrel,60,,,601580000B0430,,,,,,,,,,,,,0,,,,,BT,taillis simples,,,1530,2.557841,49.558131
