id_mutation,date_mutation,numero_disposition,nature_mutation,valeur_fonciere,adresse_numero,adresse_suffixe,adresse_nom_voie,adresse_code_voie,code_postal,code_commune,nom_commune,code_departement,ancien_code_commune,ancien_nom_commune,id_parcelle,ancien_id_parcelle,numero_volume,lot1_numero,lot1_surface_carrez,lot2_numero,lot2_surface_carrez,lot3_numero,lot3_surface_carrez,lot4_numero,lot4_surface_carrez,lot5_numero,lot5_surface_carrez,nombre_lots,code_type_local,type_local,surface_reelle_bati,nombre_pieces_principales,code_nature_culture,nature_culture,code_nature_culture_speciale,nature_culture_speciale,surface_terrain,longitude,latitude
2021-1007152,2021-03-02,000001,Vente,237000,1,,PL DE L AUNETTE,0005,60590,60208,Énencourt-Léage,60,,,602080000A0200,,,,,,,,,,,,,0,1,Maison,130,8,S,sols,,,960,1.847477,49.306809
2021-1008091,2021-04-15,000001,Vente,647700,,,LES PRES DU MOULIN A DRAPS,B021,60590,60208,Énencourt-Léage,60,,,602080000C0068,,,,,,,,,,,,,0,,,,,S,sols,,,22,1.84557,49.300599
2021-1008091,2021-04-15,000001,Vente,647700,,,LES PRES DU MOULIN A DRAPS,B021,60590,60208,Énencourt-Léage,60,,,602080000C0073,,,,,,,,,,,,,0,,,,,PH,herbages,,,2011,1.846007,49.30083
2021-1008091,2021-04-15,000001,Vente,647700,,,LES PRES DU MOULIN A DRAPS,B021,60590,60208,Énencourt-Léage,60,,,602080000C0074,,,,,,,,,,,,,0,,,,,PH,herbages,,,153,1.846178,49.300839
2021-1008091,2021-04-15,000001,Vente,647700,9,,RUE DE LA TANNERIE,0040,60590,60208,Énencourt-Léage,60,,,602080000D0111,,,,,,,,,,,,,0,3,Dépendance,,0,J,jardins,,,1804,1.845511,49.300917
2021-1008091,2021-04-15,000001,Vente,647700,9,,RUE DE LA TANNERIE,0040,60590,60208,Énencourt-Léage,60,,,602080000D0111,,,,,,,,,,,,,0,1,Maison,190,6,J,jardins,,,1804,1.845511,49.300917
2021-1008091,2021-04-15,000001,Vente,647700,9,,RUE DE LA TANNERIE,0040,60590,60208,Énencourt-Léage,60,,,602080000D0111,,,,,,,,,,,,,0,1,Maison,190,6,S,sols,,,296,1.845511,49.300917
2021-1008091,2021-04-15,000001,Vente,647700,9,,RUE DE LA TANNERIE,0040,60590,60208,Énencourt-Léage,60,,,602080000D0111,,,,,,,,,,,,,0,3,Dépendance,,0,S,sols,,,296,1.845511,49.300917
2021-1009208,2021-06-09,000001,Vente,310000,8,,RUE DE LA TUILERIE,0045,60590,60208,Énencourt-Léage,60,,,602080000A0084,,,,,,,,,,,,,0,1,Maison,134,5,J,jardins,,,1961,1.847311,49.305008
2021-1009208,2021-06-09,000001,Vente,310000,8,,RUE DE LA TUILERIE,0045,60590,60208,Énencourt-Léage,60,,,602080000A0084,,,,,,,,,,,,,0,1,Maison,134,5,S,sols,,,500,1.847311,49.305008
2021-1009208,2021-06-09,000001,Vente,310000,8,,RUE DE LA TUILERIE,0045,60590,60208,Énencourt-Léage,60,,,602080000A0084,,,,,,,,,,,,,0,3,Dépendance,,0,J,jardins,,,1961,1.847311,49.305008
2021-1009208,2021-06-09,000001,Vente,310000,8,,RUE DE LA TUILERIE,0045,60590,60208,Énencourt-Léage,60,,,602080000A0084,,,,,,,,,,,,,0,3,Dépendance,,0,S,sols,,,500,1.847311,49.305008
2021-1009208,2021-06-09,000001,Vente,310000,,,VILLAGE D ENENCOURT,B026,60590,60208,Énencourt-Léage,60,,,602080000A0085,,,,,,,,,,,,,0,,,,,S,sols,,,38,1.847054,49.30512
2021-1010449,2021-07-23,000001,Vente,2500,,,VILLAGE D ENENCOURT,B026,60590,60208,Énencourt-Léage,60,,,602080000A0232,,,,,,,,,,,,,0,,,,,PH,herbages,,,2508,1.84297,49.304568
2021-1012359,2021-10-05,000001,Vente,67000,,,VILLAGE D ENENCOURT,B026,60590,60208,Énencourt-Léage,60,,,602080000A0220,,,,,,,,,,,,,0,,,,,AB,terrains a bâtir,,,749,1.846559,49.305247
2021-1012662,2021-10-15,000001,Vente,503000,12,,RUE DU MOULIN,0030,60590,60208,Énencourt-Léage,60,,,602080000A0225,,,,,,,,,,,,,0,1,Maison,213,9,J,jardins,,,2029,1.846719,49.302944
2021-1012662,2021-10-15,000001,Vente,503000,12,,RUE DU MOULIN,0030,60590,60208,Énencourt-Léage,60,,,602080000A0225,,,,,,,,,,,,,0,1,Maison,213,9,S,sols,,,500,1.846719,49.302944
2021-1014190,2021-12-17,000001,Vente,193500,6,,RUE DE LA TUILERIE,0045,60590,60208,Énencourt-Léage,60,,,602080000A0082,,,,,,,,,,,,,0,1,Maison,55,3,S,sols,,,445,1.846973,49.30488
2021-1014190,2021-12-17,000001,Vente,193500,6,,RUE DE LA TUILERIE,0045,60590,60208,Énencourt-Léage,60,,,602080000A0082,,,,,,,,,,,,,0,3,Dépendance,,0,S,sols,,,445,1.846973,49.30488
2021-1014190,2021-12-17,000001,Vente,193500,6,,RUE DE LA TUILERIE,0045,60590,60208,Énencourt-Léage,60,,,602080000A0082,,,,,,,,,,,,,0,3,Dépendance,,0,S,sols,,,445,1.846973,49.30488
