id_mutation,date_mutation,numero_disposition,nature_mutation,valeur_fonciere,adresse_numero,adresse_suffixe,adresse_nom_voie,adresse_code_voie,code_postal,code_commune,nom_commune,code_departement,ancien_code_commune,ancien_nom_commune,id_parcelle,ancien_id_parcelle,numero_volume,lot1_numero,lot1_surface_carrez,lot2_numero,lot2_surface_carrez,lot3_numero,lot3_surface_carrez,lot4_numero,lot4_surface_carrez,lot5_numero,lot5_surface_carrez,nombre_lots,code_type_local,type_local,surface_reelle_bati,nombre_pieces_principales,code_nature_culture,nature_culture,code_nature_culture_speciale,nature_culture_speciale,surface_terrain,longitude,latitude
2021-1007020,2021-02-03,000001,Vente,9792,,,LE VILLAGE,B040,60420,60232,Ferrières,60,,,602320000B0708,,,,,,,,,,,,,0,,,,,P,prés,,,1754,2.520092,49.589085
2021-1007020,2021-02-03,000001,Vente,9792,,,LA MALLE EN PRISE,B028,60420,60232,Ferrières,60,,,60232000ZD0280,,,,,,,,,,,,,0,,,,,T,terres,,,1388,2.509115,49.588733
2021-1007400,2021-03-10,000001,Vente,2200,,,LES GALETS,B022,60420,60232,Ferrières,60,,,60232000ZA0038,,,,,,,,,,,,,0,,,,,T,terres,,,2550,2.503753,49.589408
2021-1007526,2021-03-03,000001,Vente,197050,22,B,RUE DE LA CROIX,0006,60420,60232,Ferrières,60,,,602320000B0638,,,,,,,,,,,,,0,1,Maison,177,5,S,sols,,,875,2.518517,49.587743
2021-1007770,2021-03-10,000001,Vente,130000,5,,RUE DE LA SENS,0015,60420,60232,Ferrières,60,,,602320000B0796,,,,,,,,,,,,,0,1,Maison,65,3,S,sols,,,308,2.511322,49.590178
2021-1008106,2021-04-10,000001,Vente,80000,,,LE CLOS DE LA SENS,B013,60420,60232,Ferrières,60,,,602320000B0620,,,,,,,,,,,,,0,,,,,J,jardins,,,1132,2.510948,49.590966
2021-1008106,2021-04-10,000001,Vente,80000,12,,RUE DE LA SENS,0015,60420,60232,Ferrières,60,,,602320000B0793,,,,,,,,,,,,,0,4,Local industriel. commercial ou assimilé,550,0,S,sols,,,579,2.511144,49.590815
2021-1010237,2021-07-03,000001,Vente,174000,11,,RUE DE LA CROIX,0006,60420,60232,Ferrières,60,,,602320000B0302,,,,,,,,,,,,,0,1,Maison,84,3,S,sols,,,616,2.517394,49.588432
2021-1010237,2021-07-03,000001,Vente,174000,11,,RUE DE LA CROIX,0006,60420,60232,Ferrières,60,,,602320000B0302,,,,,,,,,,,,,0,3,Dépendance,,0,S,sols,,,616,2.517394,49.588432
2021-1010237,2021-07-03,000001,Vente,174000,11,,RUE DE LA CROIX,0006,60420,60232,Ferrières,60,,,602320000B0302,,,,,,,,,,,,,0,3,Dépendance,,0,S,sols,,,616,2.517394,49.588432
2021-1010610,2021-07-03,000001,Vente,55000,8,,RUE DE LA SENS,0015,60420,60232,Ferrières,60,,,602320000B0164,,,,,,,,,,,,,0,3,Dépendance,,0,S,sols,,,958,2.511503,49.590851
2021-1010610,2021-07-03,000001,Vente,55000,8,,RUE DE LA SENS,0015,60420,60232,Ferrières,60,,,602320000B0164,,,,,,,,,,,,,0,3,Dépendance,,0,S,sols,,,958,2.511503,49.590851
2021-1010610,2021-07-03,000001,Vente,55000,8,,RUE DE LA SENS,0015,60420,60232,Ferrières,60,,,602320000B0164,,,,,,,,,,,,,0,3,Dépendance,,0,S,sols,,,958,2.511503,49.590851
2021-1010610,2021-07-03,000001,Vente,55000,8,,RUE DE LA SENS,0015,60420,60232,Ferrières,60,,,602320000B0164,,,,,,,,,,,,,0,1,Maison,123,3,S,sols,,,958,2.511503,49.590851
2021-1011121,2021-08-13,000001,Vente,178049,,,LE QUOIRE,B035,60420,60232,Ferrières,60,,,60232000ZD0108,,,,,,,,,,,,,0,,,,,T,terres,,,620,2.520475,49.58726
2021-1011121,2021-08-13,000001,Vente,178049,2,,RUE DU CHEMIN BLANC,0004,60420,60232,Ferrières,60,,,60232000ZD0243,,,,,,,,,,,,,0,1,Maison,99,5,S,sols,,,599,2.520729,49.587348
2021-1011854,2021-09-04,000001,Vente,150000,10,,RUE DU MOULIN,0011,60420,60232,Ferrières,60,,,602320000B0247,,,,,,,,,,,,,0,3,Dépendance,,0,S,sols,,,375,2.516929,49.591022
2021-1011854,2021-09-04,000001,Vente,150000,10,,RUE DU MOULIN,0011,60420,60232,Ferrières,60,,,602320000B0247,,,,,,,,,,,,,0,1,Maison,60,4,S,sols,,,375,2.516929,49.591022
2021-1011854,2021-09-04,000001,Vente,150000,10,,RUE DU MOULIN,0011,60420,60232,Ferrières,60,,,602320000B0247,,,,,,,,,,,,,0,3,Dépendance,,0,S,sols,,,375,2.516929,49.591022
2021-1011854,2021-09-04,000001,Vente,150000,10,,RUE DU MOULIN,0011,60420,60232,Ferrières,60,,,602320000B0247,,,,,,,,,,,,,0,3,Dépendance,,0,S,sols,,,375,2.516929,49.591022
2021-1011854,2021-09-04,000001,Vente,150000,,,LE VILLAGE,B040,60420,60232,Ferrières,60,,,602320000B0248,,,,,,,,,,,,,0,,,,,J,jardins,,,852,2.51704,49.59118
2021-1011868,2021-09-24,000001,Vente,635,,,LES LARRIS,B027,60420,60232,Ferrières,60,,,60232000ZD0148,,,,,,,,,,,,,0,,,,,P,prés,,,1270,2.517469,49.583378
2021-1011870,2021-09-24,000001,Vente,1470,,,LES LARRIS,B027,60420,60232,Ferrières,60,,,60232000ZD0146,,,,,,,,,,,,,0,,,,,P,prés,,,2940,2.517111,49.583366
2021-1011966,2021-09-10,000001,Vente,10010,,,DERRIERE LA SENS,B018,60420,60232,Ferrières,60,,,60232000ZA0028,,,,,,,,,,,,,0,,,,,T,terres,,,8995,2.503351,49.595027
2021-1011966,2021-09-10,000001,Vente,10010,,,LES GALETS,B022,60420,60232,Ferrières,60,,,60232000ZA0035,,,,,,,,,,,,,0,,,,,T,terres,,,4135,2.505247,49.588202
2021-1011966,2021-09-10,000001,Vente,10010,,,BOIS DE GRATTEPANCHE,B003,60420,60232,Ferrières,60,,,60232000ZD0176,,,,,,,,,,,,,0,,,,,T,terres,,,1170,2.509885,49.582267
2021-1012026,2021-09-11,000001,Vente,20030,,,LE CLOS DE LA SENS,B013,60420,60232,Ferrières,60,,,602320000B0145,,,,,,,,,,,,,0,,,,,S,sols,,,258,2.510213,49.59005
2021-1012026,2021-09-11,000001,Vente,20030,,,LE CLOS DE LA SENS,B013,60420,60232,Ferrières,60,,,602320000B0147,,,,,,,,,,,,,0,,,,,P,prés,,,3801,2.510258,49.590678
2021-1012026,2021-09-11,000001,Vente,20030,,,LE CLOS DE LA SENS,B013,60420,60232,Ferrières,60,,,602320000B0147,,,,,,,,,,,,,0,,,,,S,sols,,,222,2.510258,49.590678
2021-1012026,2021-09-11,000001,Vente,20030,,,LE CLOS DE LA SENS,B013,60420,60232,Ferrières,60,,,602320000B0148,,,,,,,,,,,,,0,,,,,J,jardins,,,1515,2.510396,49.591181
2021-1012026,2021-09-11,000001,Vente,20030,,,LE CLOS DE LA SENS,B013,60420,60232,Ferrières,60,,,602320000B0730,,,,,,,,,,,,,0,,,,,S,sols,,,2738,2.510504,49.590336
2021-1012026,2021-09-11,000001,Vente,20030,,,LE CLOS DE LA SENS,B013,60420,60232,Ferrières,60,,,602320000B0733,,,,,,,,,,,,,0,,,,,S,sols,,,48,2.510272,49.589822
2021-1012543,2021-10-08,000001,Vente,230000,7,,RUE DE LA CROIX,0006,60420,60232,Ferrières,60,,,602320000B0299,,,,,,,,,,,,,0,3,Dépendance,,0,S,sols,,,818,2.517228,49.58875
2021-1012543,2021-10-08,000001,Vente,230000,7,,RUE DE LA CROIX,0006,60420,60232,Ferrières,60,,,602320000B0299,,,,,,,,,,,,,0,3,Dépendance,,0,S,sols,,,818,2.517228,49.58875
2021-1012543,2021-10-08,000001,Vente,230000,7,,RUE DE LA CROIX,0006,60420,60232,Ferrières,60,,,602320000B0299,,,,,,,,,,,,,0,1,Maison,192,8,S,sols,,,818,2.517228,49.58875
2021-1012543,2021-10-08,000001,Vente,230000,7,,RUE DE LA CROIX,0006,60420,60232,Ferrières,60,,,602320000B0299,,,,,,,,,,,,,0,3,Dépendance,,0,S,sols,,,818,2.517228,49.58875
2021-1012543,2021-10-08,000001,Vente,230000,,,LE VILLAGE,B040,60420,60232,Ferrières,60,,,602320000B0608,,,,,,,,,,,,,0,,,,,J,jardins,,,270,2.517052,49.588584
2021-1014119,2021-12-21,000001,Vente,16980.8,,,LE CLOS DE LA SENS,B013,60420,60232,Ferrières,60,,,602320000B0156,,,,,,,,,,,,,0,,,,,T,terres,,,1836,2.510877,49.591607
2021-1014119,2021-12-21,000001,Vente,16980.8,,,DERRIERE LA SENS,B018,60420,60232,Ferrières,60,,,60232000ZA0017,,,,,,,,,,,,,0,,,,,T,terres,,,11970,2.510493,49.592147
2021-1014119,2021-12-21,000001,Vente,16980.8,,,DERRIERE LA SENS,B018,60420,60232,Ferrières,60,,,60232000ZA0019,,,,,,,,,,,,,0,,,,,T,terres,,,1975,2.510023,49.592827
2021-1014119,2021-12-21,000001,Vente,16980.8,,,DERRIERE LA SENS,B018,60420,60232,Ferrières,60,,,60232000ZA0057,,,,,,,,,,,,,0,,,,,T,terres,,,1975,2.510233,49.59277
2021-1014119,2021-12-21,000001,Vente,16980.8,,,DERRIERE LA SENS,B018,60420,60232,Ferrières,60,,,60232000ZA0058,,,,,,,,,,,,,0,,,,,T,terres,,,2795,2.510126,49.592799
2021-1014119,2021-12-21,000001,Vente,16980.8,,,DERRIERE LA SENS,B018,60420,60232,Ferrières,60,,,60232000ZA0059,,,,,,,,,,,,,0,,,,,T,terres,,,675,2.509969,49.592842
