id_mutation,date_mutation,numero_disposition,nature_mutation,valeur_fonciere,adresse_numero,adresse_suffixe,adresse_nom_voie,adresse_code_voie,code_postal,code_commune,nom_commune,code_departement,ancien_code_commune,ancien_nom_commune,id_parcelle,ancien_id_parcelle,numero_volume,lot1_numero,lot1_surface_carrez,lot2_numero,lot2_surface_carrez,lot3_numero,lot3_surface_carrez,lot4_numero,lot4_surface_carrez,lot5_numero,lot5_surface_carrez,nombre_lots,code_type_local,type_local,surface_reelle_bati,nombre_pieces_principales,code_nature_culture,nature_culture,code_nature_culture_speciale,nature_culture_speciale,surface_terrain,longitude,latitude
2021-1006598,2021-01-22,000001,Vente,145000,5,,RUE GRAND GILLES,0030,60650,60275,Glatigny,60,,,602750000B0897,,,,,,,,,,,,,0,1,Maison,84,4,S,sols,,,467,1.893057,49.496677
2021-1006787,2021-02-01,000002,Vente,2700,,,LE VILLAGE,B033,60650,60275,Glatigny,60,,,602750000B0905,,,,,,,,,,,,,0,,,,,PH,herbages,,,360,1.895274,49.498235
2021-1006968,2021-02-15,000001,Vente,3000,,,LE VILLAGE,B033,60650,60275,Glatigny,60,,,602750000B0097,,,,,,,,,,,,,0,,,,,L,landes,FRICH,Friche,62,1.89683,49.495305
2021-1006968,2021-02-15,000001,Vente,3000,,,LE VILLAGE,B033,60650,60275,Glatigny,60,,,602750000B0098,,,,,,,,,,,,,0,,,,,PH,herbages,,,1693,1.896961,49.495529
2021-1007089,2021-02-25,000001,Vente,2500,,,LA MINEE,B020,60650,60275,Glatigny,60,,,602750000A0299,,,,,,,,,,,,,0,,,,,T,terres,,,4332,1.906425,49.49895
2021-1010109,2021-07-06,000001,Vente,160000,1,,RUE GRAND GILLES,0030,60650,60275,Glatigny,60,,,602750000B0154,,,,,,,,,,,,,0,1,Maison,68,4,S,sols,,,539,1.894184,49.496491
2021-1010109,2021-07-06,000001,Vente,160000,1,,RUE GRAND GILLES,0030,60650,60275,Glatigny,60,,,602750000B0154,,,,,,,,,,,,,0,1,Maison,68,4,J,jardins,,,1844,1.894184,49.496491
2021-1010109,2021-07-06,000001,Vente,160000,1,,RUE GRAND GILLES,0030,60650,60275,Glatigny,60,,,602750000B0154,,,,,,,,,,,,,0,3,Dépendance,,0,J,jardins,,,1844,1.894184,49.496491
2021-1010109,2021-07-06,000001,Vente,160000,1,,RUE GRAND GILLES,0030,60650,60275,Glatigny,60,,,602750000B0154,,,,,,,,,,,,,0,3,Dépendance,,0,S,sols,,,539,1.894184,49.496491
2021-1010996,2021-08-05,000001,Vente,500,,,LA RUE DU FOUR,B030,60650,60275,Glatigny,60,,,602750000B0347,,,,,,,,,,,,,0,,,,,BT,taillis simples,,,382,1.890232,49.499348
2021-1012615,2021-10-27,000001,Vente,125000,,,LE VILLAGE,B033,60650,60275,Glatigny,60,,,602750000B0030,,,,,,,,,,,,,0,,,,,S,sols,,,8,1.894106,49.496853
2021-1012615,2021-10-27,000001,Vente,125000,,,LE VILLAGE,B033,60650,60275,Glatigny,60,,,602750000B0030,,,,,,,,,,,,,0,,,,,J,jardins,,,255,1.894106,49.496853
2021-1012615,2021-10-27,000001,Vente,125000,,,LE VILLAGE,B033,60650,60275,Glatigny,60,,,602750000B0753,,,,,,,,,,,,,0,,,,,PH,herbages,,,186,1.893774,49.496886
2021-1012615,2021-10-27,000001,Vente,125000,3,,RUE DUBOS,0020,60650,60275,Glatigny,60,,,602750000B0833,,,,,,,,,,,,,0,1,Maison,90,4,S,sols,,,1309,1.894184,49.49696
