id_mutation,date_mutation,numero_disposition,nature_mutation,valeur_fonciere,adresse_numero,adresse_suffixe,adresse_nom_voie,adresse_code_voie,code_postal,code_commune,nom_commune,code_departement,ancien_code_commune,ancien_nom_commune,id_parcelle,ancien_id_parcelle,numero_volume,lot1_numero,lot1_surface_carrez,lot2_numero,lot2_surface_carrez,lot3_numero,lot3_surface_carrez,lot4_numero,lot4_surface_carrez,lot5_numero,lot5_surface_carrez,nombre_lots,code_type_local,type_local,surface_reelle_bati,nombre_pieces_principales,code_nature_culture,nature_culture,code_nature_culture_speciale,nature_culture_speciale,surface_terrain,longitude,latitude
2021-1014619,2021-01-29,000001,Vente,88000,8,,PL DE LA REPUBLIQUE,7150,60190,60281,Gournay-sur-Aronde,60,,,602810000E1372,,,,,,,,,,,,,0,1,Maison,46,4,S,sols,,,198,2.675461,49.493822
2021-1014993,2021-01-22,000001,Vente,400000,,,SAINT MAUR,B064,60190,60281,Gournay-sur-Aronde,60,,,602810000B0276,,,,,,,,,,,,,0,,,,,J,jardins,POTAG,Jardin potager,685,2.691668,49.523098
2021-1014993,2021-01-22,000001,Vente,400000,,,SAINT MAUR,B064,60190,60281,Gournay-sur-Aronde,60,,,602810000B0278,,,,,,,,,,,,,0,,,,,S,sols,,,600,2.691832,49.523715
2021-1014993,2021-01-22,000001,Vente,400000,4,,RUE DE LILLE,4850,60190,60281,Gournay-sur-Aronde,60,,,602810000B0279,,,,,,,,,,,,,0,1,Maison,185,7,S,sols,,,1063,2.692127,49.52343
2021-1014993,2021-01-22,000001,Vente,400000,4,,RUE DE LILLE,4850,60190,60281,Gournay-sur-Aronde,60,,,602810000B0279,,,,,,,,,,,,,0,1,Maison,50,3,S,sols,,,1063,2.692127,49.52343
2021-1014993,2021-01-22,000001,Vente,400000,,,SAINT MAUR,B064,60190,60281,Gournay-sur-Aronde,60,,,602810000B0282,,,,,,,,,,,,,0,,,,,T,terres,,,238,2.691381,49.523572
2021-1014993,2021-01-22,000001,Vente,400000,,,SAINT MAUR,B064,60190,60281,Gournay-sur-Aronde,60,,,602810000B0283,,1,,,,,,,,,,,0,,,,,,,,,,2.69189,49.523871
2021-1014993,2021-01-22,000001,Vente,400000,,,SAINT MAUR,B064,60190,60281,Gournay-sur-Aronde,60,,,602810000B0283,,2,,,,,,,,,,,0,,,,,,,,,,2.69189,49.523871
2021-1014993,2021-01-22,000001,Vente,400000,,,SAINT MAUR,B064,60190,60281,Gournay-sur-Aronde,60,,,602810000B0284,,,,,,,,,,,,,0,,,,,T,terres,,,249,2.692137,49.524028
2021-1016256,2021-04-09,000001,Vente,14300,2,,RUE DE LA GARENNE,2950,60190,60281,Gournay-sur-Aronde,60,,,602810000B0274,,,,,,,,,,,,,0,4,Local industriel. commercial ou assimilé,160,0,S,sols,,,2026,2.692652,49.524174
2021-1016257,2021-04-09,000002,Vente,99300,3,,RUE DE LA GARENNE,2950,60190,60281,Gournay-sur-Aronde,60,,,602810000B0268,,,,,,,,,,,,,0,1,Maison,96,3,S,sols,,,208,2.692506,49.524159
2021-1017510,2021-05-28,000001,Vente,135000,22,,RUE GASTON ET M. COURSEAUX,3000,60190,60281,Gournay-sur-Aronde,60,,,602810000E1647,,,,,,,,,,,,,0,1,Maison,96,4,S,sols,,,447,2.673126,49.491743
2021-1017722,2021-06-07,000001,Vente,229000,,,LE VILLAGE,B078,60190,60281,Gournay-sur-Aronde,60,,,602810000E1402,,,,,,,,,,,,,0,,,,,J,jardins,POTAG,Jardin potager,650,2.677941,49.494519
2021-1017722,2021-06-07,000001,Vente,229000,13,,RUE DE RESSONS,7200,60190,60281,Gournay-sur-Aronde,60,,,602810000E1403,,,,,,,,,,,,,0,3,Dépendance,,0,J,jardins,POTAG,Jardin potager,280,2.677801,49.494464
2021-1017722,2021-06-07,000001,Vente,229000,13,,RUE DE RESSONS,7200,60190,60281,Gournay-sur-Aronde,60,,,602810000E1403,,,,,,,,,,,,,0,1,Maison,109,4,J,jardins,POTAG,Jardin potager,280,2.677801,49.494464
2021-1017722,2021-06-07,000001,Vente,229000,,,LE VILLAGE,B078,60190,60281,Gournay-sur-Aronde,60,,,602810000E1404,,,,,,,,,,,,,0,,,,,J,jardins,POTAG,Jardin potager,275,2.677761,49.494382
2021-1018001,2021-06-09,000001,Vente,198000,3,,RUE DE PARIS,6380,60190,60281,Gournay-sur-Aronde,60,,,602810000E1623,,,,,,,,,,,,,0,3,Dépendance,,0,S,sols,,,287,2.674891,49.492479
2021-1018001,2021-06-09,000001,Vente,198000,3,,RUE DE PARIS,6380,60190,60281,Gournay-sur-Aronde,60,,,602810000E1623,,,,,,,,,,,,,0,1,Maison,99,4,S,sols,,,287,2.674891,49.492479
2021-1018001,2021-06-09,000001,Vente,198000,3,,RUE DE PARIS,6380,60190,60281,Gournay-sur-Aronde,60,,,602810000E1623,,,,,,,,,,,,,0,3,Dépendance,,0,S,sols,,,287,2.674891,49.492479
2021-1018813,2021-06-28,000001,Vente,237000,,,LE VILLAGE,B078,60190,60281,Gournay-sur-Aronde,60,,,602810000E1539,,,,,,,,,,,,,0,,,,,PA,pâtures,PATUR,Pâture plantée,299,2.67645,49.490606
2021-1018813,2021-06-28,000001,Vente,237000,,,LE VILLAGE,B078,60190,60281,Gournay-sur-Aronde,60,,,602810000E1539,,,,,,,,,,,,,0,,,,,S,sols,,,36,2.67645,49.490606
2021-1018813,2021-06-28,000001,Vente,237000,5,,RUE VERTE,9000,60190,60281,Gournay-sur-Aronde,60,,,602810000E1821,,,,,,,,,,,,,0,3,Dépendance,,0,S,sols,,,453,2.676497,49.490703
2021-1018813,2021-06-28,000001,Vente,237000,5,,RUE VERTE,9000,60190,60281,Gournay-sur-Aronde,60,,,602810000E1821,,,,,,,,,,,,,0,3,Dépendance,,0,S,sols,,,453,2.676497,49.490703
2021-1018813,2021-06-28,000001,Vente,237000,5,,RUE VERTE,9000,60190,60281,Gournay-sur-Aronde,60,,,602810000E1821,,,,,,,,,,,,,0,1,Maison,100,5,S,sols,,,453,2.676497,49.490703
2021-1018813,2021-06-28,000001,Vente,237000,5,,RUE VERTE,9000,60190,60281,Gournay-sur-Aronde,60,,,602810000E1822,,,,,,,,,,,,,0,,,,,S,sols,,,22,2.676442,49.490784
2021-1018813,2021-06-28,000001,Vente,237000,5,,RUE VERTE,9000,60190,60281,Gournay-sur-Aronde,60,,,602810000E1823,,,,,,,,,,,,,0,,,,,S,sols,,,22,2.676472,49.490763
2021-1019539,2021-07-20,000001,Vente,295000,14,,RUE DU FOUR,2800,60190,60281,Gournay-sur-Aronde,60,,,602810000E1849,,,,,,,,,,,,,0,1,Maison,110,4,S,sols,,,780,2.67582,49.490484
2021-1020892,2021-09-03,000001,Vente,3000,,,RUE GASTON ET M. COURSEAUX,3000,60190,60281,Gournay-sur-Aronde,60,,,602810000E1920,,,,,,,,,,,,,0,,,,,S,sols,,,150,2.672565,49.491743
2021-1022648,2021-11-15,000001,Vente,157000,7,,PL DU JEU DE PAUME,4300,60190,60281,Gournay-sur-Aronde,60,,,602810000E1453,,,,,,,,,,,,,0,3,Dépendance,,0,S,sols,,,242,2.676742,49.492133
2021-1022648,2021-11-15,000001,Vente,157000,7,,PL DU JEU DE PAUME,4300,60190,60281,Gournay-sur-Aronde,60,,,602810000E1453,,,,,,,,,,,,,0,3,Dépendance,,0,S,sols,,,242,2.676742,49.492133
2021-1022648,2021-11-15,000001,Vente,157000,7,,PL DU JEU DE PAUME,4300,60190,60281,Gournay-sur-Aronde,60,,,602810000E1453,,,,,,,,,,,,,0,1,Maison,63,3,S,sols,,,242,2.676742,49.492133
2021-1023167,2021-12-10,000001,Vente,3216,,,LES ROUGES TERRES,B063,60190,60281,Gournay-sur-Aronde,60,,,60281000ZN0027,,,,,,,,,,,,,0,,,,,BT,taillis simples,,,3980,2.664842,49.502932
2021-1023167,2021-12-10,000001,Vente,3216,,,LES ROUGES TERRES,B063,60190,60281,Gournay-sur-Aronde,60,,,60281000ZN0027,,,,,,,,,,,,,0,,,,,T,terres,,,1380,2.664842,49.502932
