id_mutation,date_mutation,numero_disposition,nature_mutation,valeur_fonciere,adresse_numero,adresse_suffixe,adresse_nom_voie,adresse_code_voie,code_postal,code_commune,nom_commune,code_departement,ancien_code_commune,ancien_nom_commune,id_parcelle,ancien_id_parcelle,numero_volume,lot1_numero,lot1_surface_carrez,lot2_numero,lot2_surface_carrez,lot3_numero,lot3_surface_carrez,lot4_numero,lot4_surface_carrez,lot5_numero,lot5_surface_carrez,nombre_lots,code_type_local,type_local,surface_reelle_bati,nombre_pieces_principales,code_nature_culture,nature_culture,code_nature_culture_speciale,nature_culture_speciale,surface_terrain,longitude,latitude
2021-1014337,2021-01-14,000001,Vente,214850,,,LE VILLAGE,B060,60320,60447,Néry,60,,,604470000A0769,,,,,,,,,,,,,0,,,,,S,sols,,,493,2.776699,49.282095
2021-1014337,2021-01-14,000001,Vente,214850,30,,RUE DES PEUPLIERS,0081,60320,60447,Néry,60,,,604470000A1692,,,,,,,,,,,,,0,1,Maison,99,4,S,sols,,,244,2.776978,49.282093
2021-1014463,2021-01-11,000001,Vente,135000,,,HULEUX,B039,60320,60447,Néry,60,,,604470000C0696,,,,,,,,,,,,,0,,,,,S,sols,,,209,2.759746,49.258236
2021-1014463,2021-01-11,000001,Vente,135000,,,HULEUX,B039,60320,60447,Néry,60,,,604470000C0696,,,,,,,,,,,,,0,,,,,T,terres,,,629,2.759746,49.258236
2021-1014463,2021-01-11,000001,Vente,135000,,,HULEUX,B039,60320,60447,Néry,60,,,604470000C0696,,,,,,,,,,,,,0,,,,,T,terres,,,209,2.759746,49.258236
2021-1014463,2021-01-11,000001,Vente,135000,,,LA REMISE DU PUISARD,B052,60320,60447,Néry,60,,,60447000ZH0092,,,,,,,,,,,,,0,,,,,T,terres,,,710,2.760343,49.258306
2021-1014895,2021-02-03,000001,Vente,155000,59,,RUE DES PEUPLIERS,0081,60320,60447,Néry,60,,,604470000A0742,,,,,,,,,,,,,0,1,Maison,55,3,S,sols,,,161,2.777082,49.279212
2021-1015477,2021-03-01,000001,Vente,160000,23,,RUE DES PEUPLIERS,0081,60320,60447,Néry,60,,,604470000A0793,,,,,,,,,,,,,0,1,Maison,92,4,S,sols,,,50,2.777361,49.282777
2021-1015477,2021-03-01,000001,Vente,160000,,,LE VILLAGE,B060,60320,60447,Néry,60,,,604470000A0795,,,,,,,,,,,,,0,,,,,S,sols,,,170,2.777208,49.282714
2021-1015477,2021-03-01,000001,Vente,160000,,,LE VILLAGE,B060,60320,60447,Néry,60,,,604470000A0926,,,,,,,,,,,,,0,,,,,J,jardins,,,333,2.777438,49.282707
2021-1015594,2021-02-27,000001,Vente,475000,40,,RUE DES PEUPLIERS,0081,60320,60447,Néry,60,,,604470000A1693,,,,,,,,,,,,,0,,,,,S,sols,,,797,2.776982,49.281463
2021-1015594,2021-02-27,000001,Vente,475000,40,,RUE DES PEUPLIERS,0081,60320,60447,Néry,60,,,604470000A1694,,,,,,,,,,,,,0,1,Maison,241,9,S,sols,,,797,2.776979,49.281571
2021-1015599,2021-02-26,000001,Vente,111000,,,HULEUX,B039,60320,60447,Néry,60,,,604470000C0706,,,,,,,,,,,,,0,,,,,T,terres,,,1085,2.759325,49.257658
2021-1016051,2021-03-25,000001,Vente,80,,,VALLEE DE FEU,B056,60320,60447,Néry,60,,,604470000A0866,,,,,,,,,,,,,0,,,,,BT,taillis simples,,,252,2.779652,49.277251
2021-1016057,2021-03-26,000001,Vente,139000,36,,GR GRANDE RUE DE VAUCELLES,0058,60320,60447,Néry,60,,,604470000A1205,,,,,,,,,,,,,0,1,Maison,63,3,S,sols,,,433,2.79123,49.297328
2021-1016057,2021-03-26,000001,Vente,139000,6704,F,VAUCELLES,B058,60320,60447,Néry,60,,,604470000A1704,,,,,,,,,,,,,0,,,,,J,jardins,,,65,2.791021,49.297239
2021-1016496,2021-04-01,000001,Vente,179000,9,,RUE DU PUITS,0086,60320,60447,Néry,60,,,604470000A1019,,,,,,,,,,,,,0,,,,,S,sols,,,5,2.779057,49.282261
2021-1016496,2021-04-01,000001,Vente,179000,13,,RUE DU PUITS,0086,60320,60447,Néry,60,,,604470000A1020,,,,,,,,,,,,,0,1,Maison,79,4,S,sols,,,147,2.779109,49.282212
2021-1016555,2021-04-08,000001,Vente,111000,,,HULEUX,B039,60320,60447,Néry,60,,,604470000C0703,,,,,,,,,,,,,0,,,,,T,terres,,,1095,2.758692,49.258057
2021-1016591,2021-04-14,000001,Vente,453300,45,,RUE DES PEUPLIERS,0081,60320,60447,Néry,60,,,604470000A0723,,,,,,,,,,,,,0,1,Maison,140,5,S,sols,,,459,2.777512,49.280197
2021-1016591,2021-04-14,000001,Vente,453300,,,LE VILLAGE,B060,60320,60447,Néry,60,,,604470000A0724,,,,,,,,,,,,,0,,,,,J,jardins,,,935,2.777941,49.280126
2021-1016726,2021-04-23,000001,Vente,47730,,,RUE DES MARMOUSSEAUX,0070,60320,60447,Néry,60,,,604470000A1172,,,,,,,,,,,,,0,3,Dépendance,,0,S,sols,,,86,2.778207,49.280066
2021-1017201,2021-05-17,000001,Vente,293250,3,,RUE DU CHATEAU D'EAU,0023,60320,60447,Néry,60,,,60447000ZA0085,,,,,,,,,,,,,0,1,Maison,133,6,AG,terrains d'agrément,,,300,2.776513,49.284437
2021-1017201,2021-05-17,000001,Vente,293250,3,,RUE DU CHATEAU D'EAU,0023,60320,60447,Néry,60,,,60447000ZA0085,,,,,,,,,,,,,0,1,Maison,133,6,S,sols,,,500,2.776513,49.284437
2021-1017267,2021-05-12,000001,Vente,171040,78,,GR GRANDE RUE DE VAUCELLES,0058,60320,60447,Néry,60,,,604470000A0278,,,,,,,,,,,,,0,1,Maison,80,5,S,sols,,,66,2.790196,49.294866
2021-1017267,2021-05-12,000001,Vente,171040,78,,GR GRANDE RUE DE VAUCELLES,0058,60320,60447,Néry,60,,,604470000A0279,,,,,,,,,,,,,0,,,,,S,sols,,,85,2.790262,49.294894
2021-1018148,2021-05-27,000001,Vente,110000,,,HULEUX,B039,60320,60447,Néry,60,,,604470000C0616,,,,,,,,,,,,,0,,,,,T,terres,,,201,2.759159,49.257892
2021-1018148,2021-05-27,000001,Vente,110000,,,HULEUX,B039,60320,60447,Néry,60,,,604470000C0623,,,,,,,,,,,,,0,,,,,S,sols,,,22,2.759266,49.257952
2021-1018148,2021-05-27,000001,Vente,110000,,,HULEUX,B039,60320,60447,Néry,60,,,604470000C0683,,,,,,,,,,,,,0,,,,,S,sols,,,43,2.758821,49.257676
2021-1018148,2021-05-27,000001,Vente,110000,,,HULEUX,B039,60320,60447,Néry,60,,,604470000C0705,,,,,,,,,,,,,0,,,,,T,terres,,,838,2.759076,49.257823
2021-1019544,2021-07-23,000001,Vente,177000,64,,GR GRANDE RUE DE VAUCELLES,0058,60320,60447,Néry,60,,,604470000A0283,,,,,,,,,,,,,0,1,Maison,66,4,S,sols,,,392,2.790308,49.295094
2021-1019544,2021-07-23,000001,Vente,177000,64,,GR GRANDE RUE DE VAUCELLES,0058,60320,60447,Néry,60,,,604470000A0283,,,,,,,,,,,,,0,3,Dépendance,,0,S,sols,,,392,2.790308,49.295094
2021-1021078,2021-09-03,000001,Vente,384000,3,,RUE DU CHAUFFOUR,0026,60320,60447,Néry,60,,,604470000A0827,,,,,,,,,,,,,0,1,Maison,112,6,S,sols,,,403,2.778358,49.284292
2021-1021078,2021-09-03,000001,Vente,384000,3,,RUE DU CHAUFFOUR,0026,60320,60447,Néry,60,,,604470000A0827,,,,,,,,,,,,,0,3,Dépendance,,0,S,sols,,,403,2.778358,49.284292
2021-1021078,2021-09-03,000001,Vente,384000,3,,RUE DU CHAUFFOUR,0026,60320,60447,Néry,60,,,604470000A0827,,,,,,,,,,,,,0,3,Dépendance,,0,S,sols,,,403,2.778358,49.284292
2021-1021078,2021-09-03,000001,Vente,384000,3,,RUE DU CHAUFFOUR,0026,60320,60447,Néry,60,,,604470000A0942,,,,,,,,,,,,,0,,,,,J,jardins,,,546,2.77851,49.284355
2021-1021078,2021-09-03,000001,Vente,384000,,,LA BRETECHE,B006,60320,60447,Néry,60,,,604470000A1716,,,,,,,,,,,,,0,,,,,AG,terrains d'agrément,,,128,2.778842,49.284489
2021-1021078,2021-09-03,000001,Vente,384000,,,LA BRETECHE,B006,60320,60447,Néry,60,,,604470000A1717,,,,,,,,,,,,,0,,,,,AG,terrains d'agrément,,,297,2.778988,49.284411
2021-1021078,2021-09-03,000001,Vente,384000,,,LA BRETECHE,B006,60320,60447,Néry,60,,,604470000A1736,,,,,,,,,,,,,0,,,,,AG,terrains d'agrément,,,245,2.778541,49.284213
2021-1022134,2021-10-22,000001,Vente,340000,,,HULEUX,B039,60320,60447,Néry,60,,,604470000C0655,,,,,,,,,,,,,0,,,,,T,terres,,,412,2.757707,49.259015
2021-1022134,2021-10-22,000001,Vente,340000,8,,RUE D'HULEUX,0062,60320,60447,Néry,60,,,604470000C0661,,,,,,,,,,,,,0,1,Maison,40,3,S,sols,,,227,2.757779,49.259062
2021-1022134,2021-10-22,000001,Vente,340000,8,,RUE D'HULEUX,0062,60320,60447,Néry,60,,,604470000C0661,,,,,,,,,,,,,0,3,Dépendance,,0,S,sols,,,227,2.757779,49.259062
2021-1023142,2021-12-09,000001,Vente,158000,29,,GR GRANDE RUE DE VAUCELLES,0058,60320,60447,Néry,60,,,604470000A0254,,,,,,,,,,,,,0,1,Maison,115,5,S,sols,,,144,2.79148,49.296049
2021-1023142,2021-12-09,000001,Vente,158000,29,,GR GRANDE RUE DE VAUCELLES,0058,60320,60447,Néry,60,,,604470000A0254,,,,,,,,,,,,,0,3,Dépendance,,0,S,sols,,,144,2.79148,49.296049
2021-1023142,2021-12-09,000001,Vente,158000,,,VAUCELLES,B058,60320,60447,Néry,60,,,604470000A1817,,,,,,,,,,,,,0,,,,,J,jardins,,,399,2.791574,49.295945
