id_mutation,date_mutation,numero_disposition,nature_mutation,valeur_fonciere,adresse_numero,adresse_suffixe,adresse_nom_voie,adresse_code_voie,code_postal,code_commune,nom_commune,code_departement,ancien_code_commune,ancien_nom_commune,id_parcelle,ancien_id_parcelle,numero_volume,lot1_numero,lot1_surface_carrez,lot2_numero,lot2_surface_carrez,lot3_numero,lot3_surface_carrez,lot4_numero,lot4_surface_carrez,lot5_numero,lot5_surface_carrez,nombre_lots,code_type_local,type_local,surface_reelle_bati,nombre_pieces_principales,code_nature_culture,nature_culture,code_nature_culture_speciale,nature_culture_speciale,surface_terrain,longitude,latitude
2021-1008535,2021-05-06,000001,Vente,11012,,,CHEMIN DE FRESNEAUX,B009,60480,60520,Le Quesnel-Aubry,60,,,60520000ZD0016,,,,,,,,,,,,,0,,,,,T,terres,,,4448,2.304256,49.52137
2021-1008535,2021-05-06,000001,Vente,11012,,,CHEMIN DE FRESNEAUX,B009,60480,60520,Le Quesnel-Aubry,60,,,60520000ZD0016,,,,,,,,,,,,,0,,,,,T,terres,,,13342,2.304256,49.52137
2021-1009461,2021-06-24,000001,Vente,40000,19,,RUE DES POISSONNIERS,0009,60480,60520,Le Quesnel-Aubry,60,,,605200000B0459,,,,,,,,,,,,,0,1,Maison,45,2,S,sols,,,634,2.306935,49.50905
2021-1009461,2021-06-24,000001,Vente,40000,19,,RUE DES POISSONNIERS,0009,60480,60520,Le Quesnel-Aubry,60,,,605200000B0459,,,,,,,,,,,,,0,3,Dépendance,,0,S,sols,,,634,2.306935,49.50905
2021-1009493,2021-06-24,000001,Echange,12000,,,LE BOIS DE LA MURAILLE,B002,60480,60520,Le Quesnel-Aubry,60,,,60520000ZC0155,,,,,,,,,,,,,0,,,,,BT,taillis simples,,,3933,2.307686,49.505231
2021-1009494,2021-06-24,000002,Echange,10000,,,LA VALLEE SORETTE,B028,60480,60520,Le Quesnel-Aubry,60,,,605200000C0102,,,,,,,,,,,,,0,,,,,BT,taillis simples,,,1290,2.331921,49.50543
2021-1009668,2021-06-28,000001,Vente,219000,6,,RUE DE LA CENSE,0016,60480,60520,Le Quesnel-Aubry,60,,,605200000B0579,,,,,,,,,,,,,0,1,Maison,97,4,S,sols,,,500,2.310804,49.509209
2021-1009668,2021-06-28,000001,Vente,219000,6,,RUE DE LA CENSE,0016,60480,60520,Le Quesnel-Aubry,60,,,605200000B0579,,,,,,,,,,,,,0,1,Maison,97,4,J,jardins,,,797,2.310804,49.509209
2021-1012456,2021-10-11,000001,Vente,786,,,LE BOULEAU MERU,B003,60480,60520,Le Quesnel-Aubry,60,,,60520000ZD0023,,,,,,,,,,,,,0,,,,,T,terres,,,2620,2.302882,49.520269
