id_mutation,date_mutation,numero_disposition,nature_mutation,valeur_fonciere,adresse_numero,adresse_suffixe,adresse_nom_voie,adresse_code_voie,code_postal,code_commune,nom_commune,code_departement,ancien_code_commune,ancien_nom_commune,id_parcelle,ancien_id_parcelle,numero_volume,lot1_numero,lot1_surface_carrez,lot2_numero,lot2_surface_carrez,lot3_numero,lot3_surface_carrez,lot4_numero,lot4_surface_carrez,lot5_numero,lot5_surface_carrez,nombre_lots,code_type_local,type_local,surface_reelle_bati,nombre_pieces_principales,code_nature_culture,nature_culture,code_nature_culture_speciale,nature_culture_speciale,surface_terrain,longitude,latitude
2021-1008130,2021-04-13,000001,Vente,60000,,,LE VILLAGE NORD,B030,60510,60530,Rémérangles,60,,,605300000D0181,,,,,,,,,,,,,0,,,,,S,sols,,,428,2.283386,49.449709
2021-1008130,2021-04-13,000001,Vente,60000,,,LE VILLAGE NORD,B030,60510,60530,Rémérangles,60,,,605300000D0181,,,,,,,,,,,,,0,,,,,J,jardins,,,844,2.283386,49.449709
2021-1008864,2021-04-29,000001,Vente,190155.52,87,,GR GRANDE RUE,0001,60510,60530,Rémérangles,60,,,605300000D0257,,,,,,,,,,,,,0,1,Maison,143,5,S,sols,,,734,2.282572,49.450602
2021-1008868,2021-04-29,000001,Vente,81744.48,87,,GR GRANDE RUE,0001,60510,60530,Rémérangles,60,,,605300000D0257,,,,,,,,,,,,,0,1,Maison,143,5,S,sols,,,734,2.282572,49.450602
2021-1011701,2021-09-16,000001,Vente,400,,,LES MARTELETS,B018,60510,60530,Rémérangles,60,,,60530000ZB0052,,,,,,,,,,,,,0,,,,,BT,taillis simples,,,489,2.267085,49.455315
2021-1013521,2021-12-10,000001,Vente,300000,,,LES MARTELETS,B018,60510,60530,Rémérangles,60,,,60530000ZB0044,,,,,,,,,,,,,0,,,,,BT,taillis simples,,,2870,2.267707,49.45578
2021-1013521,2021-12-10,000001,Vente,300000,,,LA HAUTE BORNE,B014,60510,60530,Rémérangles,60,,,60530000ZE0001,,,,,,,,,,,,,0,,,,,T,terres,,,21653,2.291078,49.462312
2021-1013521,2021-12-10,000001,Vente,300000,,,LES QUATRE MUIDS,B022,60510,60530,Rémérangles,60,,,60530000ZH0001,,,,,,,,,,,,,0,,,,,T,terres,,,99300,2.303417,49.448604
2021-1013521,2021-12-10,000001,Vente,300000,,,LES QUATRE MUIDS,B022,60510,60530,Rémérangles,60,,,60530000ZH0001,,,,,,,,,,,,,0,,,,,T,terres,,,24825,2.303417,49.448604
2021-1013521,2021-12-10,000001,Vente,300000,,,LES QUATRE MUIDS,B022,60510,60530,Rémérangles,60,,,60530000ZH0001,,,,,,,,,,,,,0,,,,,T,terres,,,24825,2.303417,49.448604
2021-1013521,2021-12-10,000001,Vente,300000,,,LE BOVE,B002,60510,60530,Rémérangles,60,,,60530000ZM0001,,,,,,,,,,,,,0,,,,,T,terres,,,111155,2.274198,49.447751
