id_mutation,date_mutation,numero_disposition,nature_mutation,valeur_fonciere,adresse_numero,adresse_suffixe,adresse_nom_voie,adresse_code_voie,code_postal,code_commune,nom_commune,code_departement,ancien_code_commune,ancien_nom_commune,id_parcelle,ancien_id_parcelle,numero_volume,lot1_numero,lot1_surface_carrez,lot2_numero,lot2_surface_carrez,lot3_numero,lot3_surface_carrez,lot4_numero,lot4_surface_carrez,lot5_numero,lot5_surface_carrez,nombre_lots,code_type_local,type_local,surface_reelle_bati,nombre_pieces_principales,code_nature_culture,nature_culture,code_nature_culture_speciale,nature_culture_speciale,surface_terrain,longitude,latitude
2021-1015183,2021-02-05,000001,Vente,315000,,,L'EGLISE,B024,60410,60541,Roberval,60,,,605410000B0061,,,,,,,,,,,,,0,,,,,S,sols,,,84,2.689629,49.2902
2021-1015183,2021-02-05,000001,Vente,315000,1,,VC CAVEE DE L'EGLISE,0060,60410,60541,Roberval,60,,,605410000B0463,,,,,,,,,,,,,0,1,Maison,170,5,S,sols,,,517,2.689772,49.290327
2021-1015183,2021-02-05,000001,Vente,315000,1,,VC CAVEE DE L'EGLISE,0060,60410,60541,Roberval,60,,,605410000B0463,,,,,,,,,,,,,0,1,Maison,55,3,S,sols,,,517,2.689772,49.290327
2021-1015183,2021-02-05,000001,Vente,315000,1,,VC CAVEE DE L'EGLISE,0060,60410,60541,Roberval,60,,,605410000B0474,,,1,,,,,,,,,,1,,,,,S,sols,,,1,2.689987,49.290369
2021-1015183,2021-02-05,000001,Vente,315000,1,,VC CAVEE DE L'EGLISE,0060,60410,60541,Roberval,60,,,605410000B0474,,,4,,,,,,,,,,1,,,,,S,sols,,,1,2.689987,49.290369
2021-1016485,2021-03-24,000001,Vente,668,,,FOND MAILLET,B030,60410,60541,Roberval,60,,,60541000ZD0023,,,,,,,,,,,,,0,,,,,T,terres,,,3340,2.671464,49.283802
2021-1016499,2021-03-24,000001,Vente,3912,,,FOND D HARCELAY,B027,60410,60541,Roberval,60,,,605410000C0015,,,,,,,,,,,,,0,,,,,T,terres,,,1450,2.681561,49.289237
2021-1016499,2021-03-24,000001,Vente,3912,,,FOND D HARCELAY,B027,60410,60541,Roberval,60,,,605410000C0016,,,,,,,,,,,,,0,,,,,T,terres,,,540,2.68185,49.288889
2021-1016603,2021-04-16,000001,Vente,254270,,,CARROY,B007,60410,60541,Roberval,60,,,605410000C0041,,,,,,,,,,,,,0,,,,,J,jardins,,,620,2.68705,49.289849
2021-1016603,2021-04-16,000001,Vente,254270,,,CARROY,B007,60410,60541,Roberval,60,,,605410000C0313,,,,,,,,,,,,,0,,,,,T,terres,,,384,2.687455,49.289969
2021-1016603,2021-04-16,000001,Vente,254270,1,,VC DE LA CAVEE MARTINE,0130,60410,60541,Roberval,60,,,605410000C0357,,,,,,,,,,,,,0,1,Maison,112,4,S,sols,,,237,2.686928,49.289854
2021-1016603,2021-04-16,000001,Vente,254270,,,COTE DE GLAGNE,B017,60410,60541,Roberval,60,,,605410000E0137,,,,,,,,,,,,,0,,,,,L,landes,FRICH,Friche,2000,2.685456,49.29073
2021-1016737,2021-04-19,000001,Vente,1600,,,BOIS DE FOND MAILLET,B002,60410,60541,Roberval,60,,,605410000D0127,,,,,,,,,,,,,0,,,,,BT,taillis simples,,,3295,2.67263,49.280654
2021-1017065,2021-04-15,000001,Vente,170000,7,B,RUE DES ECOLES,0055,60410,60541,Roberval,60,,,605410000A0580,,,,,,,,,,,,,0,4,Local industriel. commercial ou assimilé,93,0,S,sols,,,863,2.683777,49.303613
2021-1017065,2021-04-15,000001,Vente,170000,7,B,RUE DES ECOLES,0055,60410,60541,Roberval,60,,,605410000A0580,,,,,,,,,,,,,0,4,Local industriel. commercial ou assimilé,116,0,S,sols,,,863,2.683777,49.303613
2021-1017121,2021-05-07,000001,Vente,120000,,,LE HAZOY,B042,60410,60541,Roberval,60,,,605410000E0467,,,,,,,,,,,,,0,,,,,L,landes,FRICH,Friche,32,2.688591,49.291301
2021-1017121,2021-05-07,000001,Vente,120000,,,LE HAZOY,B042,60410,60541,Roberval,60,,,605410000E0471,,,,,,,,,,,,,0,,,,,S,sols,,,14,2.688644,49.291227
2021-1017121,2021-05-07,000001,Vente,120000,34,,RTE DE L'EGLISE,0061,60410,60541,Roberval,60,,,605410000E0516,,,,,,,,,,,,,0,1,Maison,120,5,S,sols,,,2576,2.688159,49.291392
2021-1018683,2021-07-06,000001,Vente,218000,14,,CHE DE FOSSE,0070,60410,60541,Roberval,60,,,605410000E0589,,,,,,,,,,,,,0,1,Maison,100,5,S,sols,,,850,2.68586,49.296043
2021-1018784,2021-06-29,000001,Vente,85000,,,LE MARAIS,B043,60410,60541,Roberval,60,,,605410000E0522,,,,,,,,,,,,,0,,,,,J,jardins,,,1413,2.689629,49.294895
2021-1018784,2021-06-29,000001,Vente,85000,4,,RTE DE L'EGLISE,0061,60410,60541,Roberval,60,,,605410000E0525,,,,,,,,,,,,,0,1,Maison,108,4,S,sols,,,516,2.689825,49.294765
2021-1018784,2021-06-29,000001,Vente,85000,4,,RTE DE L'EGLISE,0061,60410,60541,Roberval,60,,,605410000E0525,,,,,,,,,,,,,0,3,Dépendance,,0,S,sols,,,516,2.689825,49.294765
2021-1018847,2021-06-22,000001,Vente,3060,,,BOIS DE FOND MAILLET,B002,60410,60541,Roberval,60,,,605410000D0095,,,,,,,,,,,,,0,,,,,BT,taillis simples,,,773,2.674792,49.28251
2021-1018847,2021-06-22,000001,Vente,3060,,,BOIS DE FOND MAILLET,B002,60410,60541,Roberval,60,,,605410000D0097,,,,,,,,,,,,,0,,,,,BT,taillis simples,,,12,2.674285,49.281758
2021-1018847,2021-06-22,000001,Vente,3060,,,BOIS DE FOND MAILLET,B002,60410,60541,Roberval,60,,,605410000D0098,,,,,,,,,,,,,0,,,,,BT,taillis simples,,,5,2.674272,49.281675
2021-1018847,2021-06-22,000001,Vente,3060,,,BOIS DE FOND MAILLET,B002,60410,60541,Roberval,60,,,605410000D0100,,,,,,,,,,,,,0,,,,,BT,taillis simples,,,10,2.67425,49.281397
2021-1018847,2021-06-22,000001,Vente,3060,,,BOIS DE FOND MAILLET,B002,60410,60541,Roberval,60,,,605410000D0101,,,,,,,,,,,,,0,,,,,BT,taillis simples,,,25,2.674254,49.281317
2021-1018847,2021-06-22,000001,Vente,3060,,,BOIS DE FOND MAILLET,B002,60410,60541,Roberval,60,,,605410000D0138,,,,,,,,,,,,,0,,,,,BT,taillis simples,,,920,2.67282,49.281531
2021-1018847,2021-06-22,000001,Vente,3060,,,BOIS DE FOND MAILLET,B002,60410,60541,Roberval,60,,,605410000D0142,,,,,,,,,,,,,0,,,,,BT,taillis simples,,,922,2.673336,49.281633
2021-1018847,2021-06-22,000001,Vente,3060,,,BOIS DE FOND MAILLET,B002,60410,60541,Roberval,60,,,605410000D0143,,,,,,,,,,,,,0,,,,,BT,taillis simples,,,259,2.674071,49.281454
2021-1018847,2021-06-22,000001,Vente,3060,,,BOIS DE FOND MAILLET,B002,60410,60541,Roberval,60,,,605410000D0150,,,,,,,,,,,,,0,,,,,BT,taillis simples,,,565,2.673927,49.281787
2021-1018847,2021-06-22,000001,Vente,3060,,,BOIS DE FOND MAILLET,B002,60410,60541,Roberval,60,,,605410000D0152,,,,,,,,,,,,,0,,,,,BT,taillis simples,,,4553,2.673596,49.282238
2021-1018847,2021-06-22,000001,Vente,3060,,,BOIS DE FOND MAILLET,B002,60410,60541,Roberval,60,,,605410000D0156,,,,,,,,,,,,,0,,,,,BT,taillis simples,,,2437,2.672897,49.282667
2021-1018847,2021-06-22,000001,Vente,3060,,,BOIS DE FOND MAILLET,B002,60410,60541,Roberval,60,,,605410000D0166,,,,,,,,,,,,,0,,,,,BT,taillis simples,,,987,2.672134,49.282742
2021-1018847,2021-06-22,000001,Vente,3060,,,BOIS DE FOND MAILLET,B002,60410,60541,Roberval,60,,,605410000D0183,,,,,,,,,,,,,0,,,,,BT,taillis simples,,,5,2.674253,49.28148
2021-1018847,2021-06-22,000001,Vente,3060,,,BOIS DE FOND MAILLET,B002,60410,60541,Roberval,60,,,605410000D0184,,,,,,,,,,,,,0,,,,,BT,taillis simples,,,185,2.673947,49.281584
2021-1018847,2021-06-22,000001,Vente,3060,,,LES TAILLIS DE FOSSE,B051,60410,60541,Roberval,60,,,605410000E0184,,,,,,,,,,,,,0,,,,,BT,taillis simples,,,395,2.683906,49.292661
2021-1018847,2021-06-22,000001,Vente,3060,,,CAVEE DE FOSSE,B008,60410,60541,Roberval,60,,,605410000E0403,,,,,,,,,,,,,0,,,,,L,landes,FRICH,Friche,895,2.680202,49.295346
2021-1018847,2021-06-22,000001,Vente,3060,,,CAVEE DE FOSSE,B008,60410,60541,Roberval,60,,,605410000E0444,,,,,,,,,,,,,0,,,,,BT,taillis simples,,,505,2.67579,49.292148
2021-1019147,2021-07-12,000001,Vente,315000,15,,RTE DE L'EGLISE,0061,60410,60541,Roberval,60,,,605410000B0320,,,,,,,,,,,,,0,3,Dépendance,,0,T,terres,,,1128,2.689704,49.292011
2021-1019147,2021-07-12,000001,Vente,315000,15,,RTE DE L'EGLISE,0061,60410,60541,Roberval,60,,,605410000B0320,,,,,,,,,,,,,0,1,Maison,176,6,T,terres,,,1128,2.689704,49.292011
2021-1019147,2021-07-12,000001,Vente,315000,15,,RTE DE L'EGLISE,0061,60410,60541,Roberval,60,,,605410000B0320,,,,,,,,,,,,,0,1,Maison,176,6,S,sols,,,500,2.689704,49.292011
2021-1019147,2021-07-12,000001,Vente,315000,15,,RTE DE L'EGLISE,0061,60410,60541,Roberval,60,,,605410000B0320,,,,,,,,,,,,,0,3,Dépendance,,0,S,sols,,,500,2.689704,49.292011
2021-1019483,2021-07-23,000001,Vente,298000,,,L'EGLISE,B024,60410,60541,Roberval,60,,,605410000B0505,,,,,,,,,,,,,0,,,,,T,terres,,,634,2.690014,49.291494
2021-1019483,2021-07-23,000001,Vente,298000,,,L'EGLISE,B024,60410,60541,Roberval,60,,,605410000B0506,,,,,,,,,,,,,0,,,,,T,terres,,,65,2.690043,49.29162
2021-1019483,2021-07-23,000001,Vente,298000,17,,RTE DE L'EGLISE,0061,60410,60541,Roberval,60,,,605410000B0507,,,,,,,,,,,,,0,1,Maison,126,5,T,terres,,,2283,2.689515,49.291718
2021-1019483,2021-07-23,000001,Vente,298000,,,L'EGLISE,B024,60410,60541,Roberval,60,,,605410000B0508,,,,,,,,,,,,,0,,,,,J,jardins,,,973,2.689538,49.291498
2021-1019483,2021-07-23,000001,Vente,298000,,,L'EGLISE,B024,60410,60541,Roberval,60,,,605410000B0509,,,,,,,,,,,,,0,,,,,J,jardins,,,146,2.689566,49.291662
2021-1019483,2021-07-23,000001,Vente,298000,,,L'EGLISE,B024,60410,60541,Roberval,60,,,605410000B0510,,,,,,,,,,,,,0,,,,,J,jardins,,,106,2.689057,49.29141
2021-1019483,2021-07-23,000001,Vente,298000,,,L'EGLISE,B024,60410,60541,Roberval,60,,,605410000B0511,,,,,,,,,,,,,0,,,,,S,sols,,,31,2.689344,49.29161
2021-1019483,2021-07-23,000001,Vente,298000,,,L'EGLISE,B024,60410,60541,Roberval,60,,,605410000B0512,,,,,,,,,,,,,0,,,,,S,sols,,,23,2.689354,49.291681
2021-1021150,2021-09-02,000001,Vente,8740,,,SUR FOSSE,B033,60410,60541,Roberval,60,,,60541000ZC0017,,,,,,,,,,,,,0,,,,,T,terres,,,17170,2.674078,49.292722
2021-1021150,2021-09-02,000001,Vente,8740,,,HAUT DE FOND MAILLET,B040,60410,60541,Roberval,60,,,60541000ZD0031,,,,,,,,,,,,,0,,,,,T,terres,,,4680,2.670254,49.285147
2021-1021158,2021-09-24,000001,Vente,272000,5591,F,CHE DE FOSSE,0070,60410,60541,Roberval,60,,,605410000E0591,,,,,,,,,,,,,0,1,Maison,56,2,S,sols,,,500,2.684847,49.295358
2021-1021158,2021-09-24,000001,Vente,272000,5591,F,CHE DE FOSSE,0070,60410,60541,Roberval,60,,,605410000E0591,,,,,,,,,,,,,0,1,Maison,56,2,AG,terrains d'agrément,,,401,2.684847,49.295358
2021-1022612,2021-11-02,000001,Vente,8656,,,GRAND BOSQUET,B037,60410,60541,Roberval,60,,,60541000ZA0009,,,,,,,,,,,,,0,,,,,T,terres,,,10065,2.696731,49.283811
2021-1022612,2021-11-02,000001,Vente,8656,,,GRAND BOSQUET,B037,60410,60541,Roberval,60,,,60541000ZA0009,,,,,,,,,,,,,0,,,,,T,terres,,,10065,2.696731,49.283811
2021-1023800,2021-12-20,000001,Vente,323000,9,,VC DE LA CAVEE DU ROI,0150,60410,60541,Roberval,60,,,605410000A0114,,,,,,,,,,,,,0,1,Maison,86,4,S,sols,,,500,2.681738,49.302907
2021-1023800,2021-12-20,000001,Vente,323000,9,,VC DE LA CAVEE DU ROI,0150,60410,60541,Roberval,60,,,605410000A0114,,,,,,,,,,,,,0,1,Maison,86,4,AG,terrains d'agrément,,,1113,2.681738,49.302907
