id_mutation,date_mutation,numero_disposition,nature_mutation,valeur_fonciere,adresse_numero,adresse_suffixe,adresse_nom_voie,adresse_code_voie,code_postal,code_commune,nom_commune,code_departement,ancien_code_commune,ancien_nom_commune,id_parcelle,ancien_id_parcelle,numero_volume,lot1_numero,lot1_surface_carrez,lot2_numero,lot2_surface_carrez,lot3_numero,lot3_surface_carrez,lot4_numero,lot4_surface_carrez,lot5_numero,lot5_surface_carrez,nombre_lots,code_type_local,type_local,surface_reelle_bati,nombre_pieces_principales,code_nature_culture,nature_culture,code_nature_culture_speciale,nature_culture_speciale,surface_terrain,longitude,latitude
2021-1006919,2021-01-22,000001,Vente,580110,,,LE VILLAGE,B041,60590,60626,Talmontiers,60,,,606260000A0070,,,,,,,,,,,,,0,,,,,J,jardins,,,940,1.735509,49.388007
2021-1006919,2021-01-22,000001,Vente,580110,3,,RUE BORDEAUX SALMON,0005,60590,60626,Talmontiers,60,,,606260000A0071,,,,,,,,,,,,,0,1,Maison,105,1,S,sols,,,1172,1.735365,49.388211
2021-1007375,2021-02-22,000001,Vente,275000,23,,RUE DUFOUR LEBRUN,0017,60590,60626,Talmontiers,60,,,606260000C0629,,,,,,,,,,,,,0,1,Maison,131,5,S,sols,,,887,1.739329,49.384729
2021-1007375,2021-02-22,000001,Vente,275000,,,LE VILLAGE,B041,60590,60626,Talmontiers,60,,,606260000C0866,,,,,,,,,,,,,0,,,,,P,prés,,,1364,1.739652,49.384887
2021-1007781,2021-03-30,000001,Vente,111200,5,,RUE BORDEAUX SALMON,0005,60590,60626,Talmontiers,60,,,606260000A0065,,,,,,,,,,,,,0,1,Maison,55,3,S,sols,,,470,1.735698,49.387785
2021-1007886,2021-03-09,000001,Vente,92000,14,,RUE DE DIEPPE,0015,60590,60626,Talmontiers,60,,,606260000C0959,,,,,,,,,,,,,0,1,Maison,79,4,S,sols,,,411,1.737221,49.387219
2021-1008772,2021-04-30,000001,Vente,223000,21,,RUE DUFOUR LEBRUN,0017,60590,60626,Talmontiers,60,,,606260000C0839,,,,,,,,,,,,,0,1,Maison,157,7,S,sols,,,1006,1.738479,49.385591
2021-1009074,2021-05-07,000001,Vente,199000,266,,LES COMMUNES NORD,B010,60590,60626,Talmontiers,60,,,60626000ZC0026,,,,,,,,,,,,,0,1,Maison,88,6,S,sols,,,980,1.754799,49.396383
2021-1009468,2021-06-22,000001,Vente,233000,6,,RUE DE FEUQUEROLLES,0025,60590,60626,Talmontiers,60,,,606260000C0861,,,,,,,,,,,,,0,1,Maison,120,5,S,sols,,,900,1.743217,49.38407
2021-1009495,2021-06-10,000001,Vente,270000,,,PRES D EN BAS,B031,60590,60626,Talmontiers,60,,,606260000C0693,,,,,,,,,,,,,0,,,,,J,jardins,,,765,1.737562,49.384664
2021-1009495,2021-06-10,000001,Vente,270000,18,,RUE DUFOUR LEBRUN,0017,60590,60626,Talmontiers,60,,,606260000C0694,,,,,,,,,,,,,0,1,Maison,117,4,S,sols,,,957,1.737927,49.38518
2021-1009495,2021-06-10,000001,Vente,270000,18,,RUE DUFOUR LEBRUN,0017,60590,60626,Talmontiers,60,,,606260000C0694,,,,,,,,,,,,,0,3,Dépendance,,0,S,sols,,,957,1.737927,49.38518
2021-1009495,2021-06-10,000001,Vente,270000,18,,RUE DUFOUR LEBRUN,0017,60590,60626,Talmontiers,60,,,606260000C0694,,,,,,,,,,,,,0,1,Maison,32,2,S,sols,,,957,1.737927,49.38518
2021-1009495,2021-06-10,000001,Vente,270000,,,PRES D EN BAS,B031,60590,60626,Talmontiers,60,,,606260000C0695,,,,,,,,,,,,,0,,,,,P,prés,,,3090,1.737192,49.384546
2021-1009495,2021-06-10,000001,Vente,270000,,,PRES D EN BAS,B031,60590,60626,Talmontiers,60,,,606260000C0696,,,,,,,,,,,,,0,,,,,P,prés,,,2025,1.736369,49.383988
2021-1010003,2021-06-24,000001,Vente,209000,34,,RUE DES LANDES,0030,60590,60626,Talmontiers,60,,,60626000ZC0015,,,,,,,,,,,,,0,1,Maison,94,5,T,terres,,,637,1.75335,49.395074
2021-1010003,2021-06-24,000001,Vente,209000,34,,RUE DES LANDES,0030,60590,60626,Talmontiers,60,,,60626000ZC0015,,,,,,,,,,,,,0,1,Maison,94,5,S,sols,,,500,1.75335,49.395074
2021-1010005,2021-06-24,000001,Vente,210000,19,,RUE DES LANDES,0030,60590,60626,Talmontiers,60,,,606260000C0788,,,,,,,,,,,,,0,1,Maison,136,4,S,sols,,,849,1.752956,49.393646
2021-1010005,2021-06-24,000001,Vente,210000,19,,RUE DES LANDES,0030,60590,60626,Talmontiers,60,,,606260000C0788,,,,,,,,,,,,,0,3,Dépendance,,0,S,sols,,,849,1.752956,49.393646
2021-1010132,2021-07-13,000001,Vente,93500,43,,RUE DE PARIS,0040,60590,60626,Talmontiers,60,,,606260000C0994,,,,,,,,,,,,,0,1,Maison,94,6,S,sols,,,531,1.745292,49.381347
2021-1010148,2021-07-13,000001,Vente,8041,,,LES LANDES,B023,60590,60626,Talmontiers,60,,,606260000C0794,,,,,,,,,,,,,0,,,,,P,prés,,,8041,1.754182,49.393537
2021-1010151,2021-07-16,000001,Vente,1,,,LES COMMUNES SUD,B011,60590,60626,Talmontiers,60,,,60626000ZB0051,,,,,,,,,,,,,0,,,,,S,sols,,,2773,1.741378,49.390268
2021-1010342,2021-07-07,000001,Vente,225000,24,,RUE DE PARIS,0040,60590,60626,Talmontiers,60,,,606260000C0910,,,,,,,,,,,,,0,1,Maison,140,5,S,sols,,,1185,1.741702,49.384676
2021-1010342,2021-07-07,000001,Vente,225000,24,,RUE DE PARIS,0040,60590,60626,Talmontiers,60,,,606260000C0910,,,,,,,,,,,,,0,1,Maison,140,5,P,prés,,,1216,1.741702,49.384676
2021-1010342,2021-07-07,000001,Vente,225000,,,LE VILLAGE,B041,60590,60626,Talmontiers,60,,,606260000C0912,,,,,,,,,,,,,0,,,,,P,prés,,,85,1.741756,49.38453
2021-1010585,2021-07-26,000001,Vente,173000,15,,RUE DUFOUR LEBRUN,0017,60590,60626,Talmontiers,60,,,606260000C0951,,,,,,,,,,,,,0,1,Maison,50,2,S,sols,,,608,1.737356,49.386061
2021-1010639,2021-07-22,000001,Vente,184000,,,LE VILLAGE,B041,60590,60626,Talmontiers,60,,,606260000C0604,,,,,,,,,,,,,0,,,,,J,jardins,,,1250,1.736742,49.387049
2021-1010639,2021-07-22,000001,Vente,184000,1,,RUE DUFOUR LEBRUN,0017,60590,60626,Talmontiers,60,,,606260000C0605,,,,,,,,,,,,,0,1,Maison,84,5,S,sols,,,910,1.736355,49.386927
2021-1010639,2021-07-22,000001,Vente,184000,1,,RUE DUFOUR LEBRUN,0017,60590,60626,Talmontiers,60,,,606260000C0605,,,,,,,,,,,,,0,3,Dépendance,,0,S,sols,,,910,1.736355,49.386927
2021-1010639,2021-07-22,000001,Vente,184000,1,,RUE DUFOUR LEBRUN,0017,60590,60626,Talmontiers,60,,,606260000C0605,,,,,,,,,,,,,0,3,Dépendance,,0,S,sols,,,910,1.736355,49.386927
2021-1010800,2021-07-30,000001,Vente,45000,,,LES LANDES,B023,60590,60626,Talmontiers,60,,,606260000C0012,,,,,,,,,,,,,0,,,,,S,sols,,,22,1.751428,49.392558
2021-1010800,2021-07-30,000001,Vente,45000,,,LES LANDES,B023,60590,60626,Talmontiers,60,,,606260000C0932,,,,,,,,,,,,,0,,,,,J,jardins,,,1071,1.75119,49.392564
2021-1010906,2021-08-16,000001,Vente,200000,8,,RUE DES FORQUEVAIS,0027,60590,60626,Talmontiers,60,,,606260000C0019,,,,,,,,,,,,,0,3,Dépendance,,0,S,sols,,,84,1.7515,49.393445
2021-1010906,2021-08-16,000001,Vente,200000,8,,RUE DES FORQUEVAIS,0027,60590,60626,Talmontiers,60,,,606260000C0019,,,,,,,,,,,,,0,1,Maison,75,3,S,sols,,,84,1.7515,49.393445
2021-1010906,2021-08-16,000001,Vente,200000,,,LES LANDES,B023,60590,60626,Talmontiers,60,,,606260000C0020,,,,,,,,,,,,,0,,,,,J,jardins,,,1044,1.751598,49.393281
2021-1010906,2021-08-16,000001,Vente,200000,,,LES LANDES,B023,60590,60626,Talmontiers,60,,,606260000C0796,,,,,,,,,,,,,0,,,,,S,sols,,,145,1.751359,49.393371
2021-1011398,2021-08-18,000001,Vente,4205,,,LES MAROLLETTES,B025,60590,60626,Talmontiers,60,,,606260000C0218,,,,,,,,,,,,,0,,,,,BT,taillis simples,,,650,1.762513,49.395497
2021-1011398,2021-08-18,000001,Vente,4205,,,LES MAROLLETTES,B025,60590,60626,Talmontiers,60,,,606260000C0249,,,,,,,,,,,,,0,,,,,BT,taillis simples,,,1610,1.758398,49.397983
2021-1011398,2021-08-18,000001,Vente,4205,,,LA VANNE D EN HAUT,B040,60590,60626,Talmontiers,60,,,606260000C0259,,,,,,,,,,,,,0,,,,,BT,taillis simples,,,1190,1.759522,49.400104
2021-1011398,2021-08-18,000001,Vente,4205,,,LA VALLEE BOULARD,B037,60590,60626,Talmontiers,60,,,606260000C0272,,,,,,,,,,,,,0,,,,,BT,taillis simples,,,755,1.764059,49.399135
2021-1011403,2021-08-18,000001,Vente,1447.5,,,LES PETITS MONTS,B029,60590,60626,Talmontiers,60,,,606260000B0056,,,,,,,,,,,,,0,,,,,BT,taillis simples,,,2895,1.740694,49.397643
2021-1011407,2021-08-18,000001,Vente,10740,,,LES HEURT-LY,B021,60590,60626,Talmontiers,60,,,606260000C0301,,,,,,,,,,,,,0,,,,,BT,taillis simples,,,765,1.767756,49.399355
2021-1011407,2021-08-18,000001,Vente,10740,,,LES HEURT-LY,B021,60590,60626,Talmontiers,60,,,606260000C0302,,,,,,,,,,,,,0,,,,,BT,taillis simples,,,760,1.767957,49.399572
2021-1011407,2021-08-18,000001,Vente,10740,,,LES HEURT-LY,B021,60590,60626,Talmontiers,60,,,606260000C0304,,,,,,,,,,,,,0,,,,,BT,taillis simples,,,9215,1.767626,49.399486
2021-1011408,2021-08-31,000001,Vente,190200,1,B,RUE DU VAL D UN OEUF,0055,60590,60626,Talmontiers,60,,,606260000C0911,,,,,,,,,,,,,0,1,Maison,90,4,S,sols,,,1074,1.742035,49.38476
2021-1011773,2021-09-13,000001,Vente,12600,,,LES MAROLLETTES,B025,60590,60626,Talmontiers,60,,,606260000C0207,,,,,,,,,,,,,0,,,,,BT,taillis simples,,,300,1.760274,49.396708
2021-1011773,2021-09-13,000001,Vente,12600,,,LA VANNE D EN HAUT,B040,60590,60626,Talmontiers,60,,,606260000C0256,,,,,,,,,,,,,0,,,,,BT,taillis simples,,,1300,1.759924,49.400653
2021-1011773,2021-09-13,000001,Vente,12600,,,LA VALLEE BOULARD,B037,60590,60626,Talmontiers,60,,,606260000C0261,,,,,,,,,,,,,0,,,,,BT,taillis simples,,,9545,1.762289,49.39962
2021-1011773,2021-09-13,000001,Vente,12600,,,LA VALLEE BOULARD,B037,60590,60626,Talmontiers,60,,,606260000C0268,,,,,,,,,,,,,0,,,,,BT,taillis simples,,,700,1.763813,49.399254
2021-1011773,2021-09-13,000001,Vente,12600,,,LA VALLEE BOULARD,B037,60590,60626,Talmontiers,60,,,606260000C0271,,,,,,,,,,,,,0,,,,,BT,taillis simples,,,755,1.76403,49.39921
2021-1012711,2021-10-25,000001,Vente,138000,15,,RUE DES LANDES,0030,60590,60626,Talmontiers,60,,,606260000C0022,,,,,,,,,,,,,0,1,Maison,50,3,S,sols,,,255,1.752605,49.393265
2021-1012711,2021-10-25,000001,Vente,138000,15,,RUE DES LANDES,0030,60590,60626,Talmontiers,60,,,606260000C0022,,,,,,,,,,,,,0,3,Dépendance,,0,S,sols,,,255,1.752605,49.393265
2021-1012711,2021-10-25,000001,Vente,138000,15,,RUE DES LANDES,0030,60590,60626,Talmontiers,60,,,606260000C0022,,,,,,,,,,,,,0,3,Dépendance,,0,S,sols,,,255,1.752605,49.393265
2021-1012711,2021-10-25,000001,Vente,138000,,,LES LANDES,B023,60590,60626,Talmontiers,60,,,606260000C0023,,,,,,,,,,,,,0,,,,,P,prés,,,425,1.752723,49.393364
2021-1012711,2021-10-25,000001,Vente,138000,,,LES LANDES,B023,60590,60626,Talmontiers,60,,,606260000C0024,,,,,,,,,,,,,0,,,,,J,jardins,,,425,1.752874,49.393253
2021-1012908,2021-10-21,000001,Vente,150000,29,,RUE DES LANDES,0030,60590,60626,Talmontiers,60,,,606260000C0038,,,,,,,,,,,,,0,3,Dépendance,,0,S,sols,,,296,1.753986,49.39423
2021-1012908,2021-10-21,000001,Vente,150000,29,,RUE DES LANDES,0030,60590,60626,Talmontiers,60,,,606260000C0038,,,,,,,,,,,,,0,3,Dépendance,,0,S,sols,,,296,1.753986,49.39423
2021-1012908,2021-10-21,000001,Vente,150000,29,,RUE DES LANDES,0030,60590,60626,Talmontiers,60,,,606260000C0038,,,,,,,,,,,,,0,1,Maison,62,3,S,sols,,,296,1.753986,49.39423
2021-1012908,2021-10-21,000001,Vente,150000,,,LES LANDES,B023,60590,60626,Talmontiers,60,,,606260000C0039,,,,,,,,,,,,,0,,,,,J,jardins,,,614,1.754172,49.394147
2021-1012908,2021-10-21,000001,Vente,150000,,,LES LANDES,B023,60590,60626,Talmontiers,60,,,606260000C0040,,,,,,,,,,,,,0,,,,,P,prés,,,1660,1.754481,49.394083
2021-1012908,2021-10-21,000001,Vente,150000,,,LES LANDES,B023,60590,60626,Talmontiers,60,,,606260000C0704,,,,,,,,,,,,,0,,,,,P,prés,,,401,1.753954,49.394107
2021-1012974,2021-11-04,000001,Vente,5500,,,LE MOULIN FLAMAND,B027,60590,60626,Talmontiers,60,,,60626000ZA0013,,,,,,,,,,,,,0,,,,,P,prés,,,3680,1.725096,49.392467
2021-1013472,2021-11-26,000001,Vente,185000,7,,IMP DES JONQUILLES,0031,60590,60626,Talmontiers,60,,,60626000ZE0066,,,,,,,,,,,,,0,1,Maison,109,5,S,sols,,,797,1.745827,49.38376
2021-1013552,2021-12-08,000001,Vente,91800,1,,RUE DE PARIS,0040,60590,60626,Talmontiers,60,,,606260000C0594,,,,,,,,,,,,,0,1,Maison,75,3,S,sols,,,650,1.738897,49.386054
2021-1013552,2021-12-08,000001,Vente,91800,1,,RUE DE PARIS,0040,60590,60626,Talmontiers,60,,,606260000C0594,,,,,,,,,,,,,0,4,Local industriel. commercial ou assimilé,40,0,S,sols,,,650,1.738897,49.386054
2021-1013552,2021-12-08,000001,Vente,91800,1,,RUE DE PARIS,0040,60590,60626,Talmontiers,60,,,606260000C0594,,,,,,,,,,,,,0,3,Dépendance,,0,S,sols,,,650,1.738897,49.386054
2021-1013552,2021-12-08,000001,Vente,91800,1,,RUE DE PARIS,0040,60590,60626,Talmontiers,60,,,606260000C0594,,,,,,,,,,,,,0,3,Dépendance,,0,S,sols,,,650,1.738897,49.386054
2021-1014044,2021-12-29,000001,Vente,40000,,,LES LANDES,B023,60590,60626,Talmontiers,60,,,606260000C0973,,,,,,,,,,,,,0,,,,,AB,terrains a bâtir,,,597,1.751943,49.392993
2021-1014044,2021-12-29,000001,Vente,40000,,,LES LANDES,B023,60590,60626,Talmontiers,60,,,606260000C0976,,,,,,,,,,,,,0,,,,,S,sols,,,35,1.752104,49.392912
