id_mutation,date_mutation,numero_disposition,nature_mutation,valeur_fonciere,adresse_numero,adresse_suffixe,adresse_nom_voie,adresse_code_voie,code_postal,code_commune,nom_commune,code_departement,ancien_code_commune,ancien_nom_commune,id_parcelle,ancien_id_parcelle,numero_volume,lot1_numero,lot1_surface_carrez,lot2_numero,lot2_surface_carrez,lot3_numero,lot3_surface_carrez,lot4_numero,lot4_surface_carrez,lot5_numero,lot5_surface_carrez,nombre_lots,code_type_local,type_local,surface_reelle_bati,nombre_pieces_principales,code_nature_culture,nature_culture,code_nature_culture_speciale,nature_culture_speciale,surface_terrain,longitude,latitude
2021-1024764,2021-01-28,000002,Vente,110000,,,LE BOURG-EST,B016,61440,61278,Messei,61,,,61278000AE0179,,,,,,,,,,,,,0,,,,,S,sols,,,238,-0.537005,48.712211
2021-1024764,2021-01-28,000002,Vente,110000,6,,RUE ALFRED RIEGLER,0046,61440,61278,Messei,61,,,61278000AE0196,,,,,,,,,,,,,0,1,Maison,160,5,S,sols,,,482,-0.537626,48.712495
2021-1024764,2021-01-28,000002,Vente,110000,4,,RUE DE LA LIBERATION,0180,61440,61278,Messei,61,,,61278000AE0218,,,,,,,,,,,,,0,,,,,P,prés,,,465,-0.537476,48.712343
2021-1025162,2021-02-13,000001,Vente,48000,4,,LE MOULIN,B067,61440,61278,Messei,61,,,61278000ZL0045,,,,,,,,,,,,,0,1,Maison,99,4,L,landes,,,218,-0.531967,48.704937
2021-1025162,2021-02-13,000001,Vente,48000,4,,LE MOULIN,B067,61440,61278,Messei,61,,,61278000ZL0045,,,,,,,,,,,,,0,1,Maison,99,4,S,sols,,,1000,-0.531967,48.704937
2021-1025162,2021-02-13,000001,Vente,48000,4,,LE MOULIN,B067,61440,61278,Messei,61,,,61278000ZL0045,,,,,,,,,,,,,0,1,Maison,99,4,P,prés,,,604,-0.531967,48.704937
2021-1025162,2021-02-13,000001,Vente,48000,4,,LE MOULIN,B067,61440,61278,Messei,61,,,61278000ZL0045,,,,,,,,,,,,,0,1,Maison,99,4,J,jardins,POTAG,Jardin potager,937,-0.531967,48.704937
2021-1025202,2021-02-19,000001,Vente,215000,,,LA PACOTIERE NORD,B069,61440,61278,Messei,61,,,61278000ZE0062,,,,,,,,,,,,,0,,,,,S,sols,,,239,-0.513713,48.729713
2021-1025202,2021-02-19,000001,Vente,215000,,,LA PACOTIERE NORD,B069,61440,61278,Messei,61,,,61278000ZE0064,,,,,,,,,,,,,0,,,,,S,sols,,,167,-0.513883,48.729573
2021-1025202,2021-02-19,000001,Vente,215000,6,,LA PACOTIERE,B123,61440,61278,Messei,61,,,61278000ZE0067,,,,,,,,,,,,,0,1,Maison,66,2,S,sols,,,1000,-0.513657,48.730092
2021-1025202,2021-02-19,000001,Vente,215000,6,,LA PACOTIERE,B123,61440,61278,Messei,61,,,61278000ZE0067,,,,,,,,,,,,,0,1,Maison,66,2,AG,terrains d'agrément,PARC,Parc,403,-0.513657,48.730092
2021-1025202,2021-02-19,000001,Vente,215000,,,LA PACOTIERE NORD,B069,61440,61278,Messei,61,,,61278000ZE0069,,,,,,,,,,,,,0,,,,,S,sols,,,134,-0.513502,48.729942
2021-1025452,2021-02-24,000001,Vente,83000,10,,LE GUE,B051,61440,61278,Messei,61,,,61278000ZO0094,,,,,,,,,,,,,0,1,Maison,110,5,S,sols,,,1565,-0.560484,48.710402
2021-1025452,2021-02-24,000001,Vente,83000,10,,LE GUE,B051,61440,61278,Messei,61,,,61278000ZO0094,,,,,,,,,,,,,0,3,Dépendance,,0,J,jardins,POTAG,Jardin potager,459,-0.560484,48.710402
2021-1025452,2021-02-24,000001,Vente,83000,10,,LE GUE,B051,61440,61278,Messei,61,,,61278000ZO0094,,,,,,,,,,,,,0,3,Dépendance,,0,J,jardins,POTAG,Jardin potager,459,-0.560484,48.710402
2021-1025452,2021-02-24,000001,Vente,83000,10,,LE GUE,B051,61440,61278,Messei,61,,,61278000ZO0094,,,,,,,,,,,,,0,1,Maison,110,5,P,prés,,,259,-0.560484,48.710402
2021-1025452,2021-02-24,000001,Vente,83000,10,,LE GUE,B051,61440,61278,Messei,61,,,61278000ZO0094,,,,,,,,,,,,,0,3,Dépendance,,0,P,prés,,,259,-0.560484,48.710402
2021-1025452,2021-02-24,000001,Vente,83000,10,,LE GUE,B051,61440,61278,Messei,61,,,61278000ZO0094,,,,,,,,,,,,,0,3,Dépendance,,0,P,prés,,,259,-0.560484,48.710402
2021-1025452,2021-02-24,000001,Vente,83000,10,,LE GUE,B051,61440,61278,Messei,61,,,61278000ZO0094,,,,,,,,,,,,,0,1,Maison,110,5,J,jardins,POTAG,Jardin potager,459,-0.560484,48.710402
2021-1025452,2021-02-24,000001,Vente,83000,10,,LE GUE,B051,61440,61278,Messei,61,,,61278000ZO0094,,,,,,,,,,,,,0,3,Dépendance,,0,S,sols,,,1565,-0.560484,48.710402
2021-1025452,2021-02-24,000001,Vente,83000,10,,LE GUE,B051,61440,61278,Messei,61,,,61278000ZO0094,,,,,,,,,,,,,0,3,Dépendance,,0,S,sols,,,1565,-0.560484,48.710402
2021-1025668,2021-03-16,000001,Vente,162000,6,,LA CHEMINIERE,B040,61440,61278,Messei,61,,,61278000ZO0089,,,,,,,,,,,,,0,1,Maison,118,4,P,prés,,,4401,-0.566024,48.709824
2021-1025668,2021-03-16,000001,Vente,162000,6,,LA CHEMINIERE,B040,61440,61278,Messei,61,,,61278000ZO0089,,,,,,,,,,,,,0,1,Maison,118,4,S,sols,,,686,-0.566024,48.709824
2021-1026813,2021-04-29,000001,Vente,28440,36,,RUE LOUVOIS,0200,61440,61278,Messei,61,,,61278000AI0408,,,,,,,,,,,,,0,,,,,P,prés,,,720,-0.536724,48.709324
2021-1027033,2021-05-07,000001,Vente,7002,,,LES PERRUCHES,B076,61440,61278,Messei,61,,,61278000ZA0018,,,,,,,,,,,,,0,,,,,T,terres,,,11670,-0.556767,48.718972
2021-1027097,2021-05-11,000001,Vente,94000,16,,RUE DE LA MOTTE ANGOT,0234,61440,61278,Messei,61,,,61278000AK0123,,,,,,,,,,,,,0,1,Maison,60,3,S,sols,,,374,-0.540632,48.721047
2021-1027097,2021-05-11,000001,Vente,94000,16,,RUE DE LA MOTTE ANGOT,0234,61440,61278,Messei,61,,,61278000AK0123,,,,,,,,,,,,,0,3,Dépendance,,0,S,sols,,,374,-0.540632,48.721047
2021-1027097,2021-05-11,000001,Vente,94000,18,,RUE DE LA MOTTE ANGOT,0234,61440,61278,Messei,61,,,61278000AK0175,,,,,,,,,,,,,0,,,,,S,sols,,,30,-0.540742,48.721152
2021-1027116,2021-05-27,000002,Vente,32700,,,LE CHATEAU,B039,61440,61278,Messei,61,,,61278000ZL0070,,,,,,,,,,,,,0,,,,,AB,terrains a bâtir,RUE,Rue,1418,-0.543821,48.709346
2021-1027163,2021-06-07,000001,Vente,120000,15,,RUE DE LA MOTTE ANGOT,0234,61440,61278,Messei,61,,,61278000AK0106,,,,,,,,,,,,,0,1,Maison,114,7,S,sols,,,701,-0.541202,48.720824
2021-1027168,2021-05-20,000001,Vente terrain à bâtir,25515,17,,RUE SIMONE VEIL,0330,61440,61278,Messei,61,,,61278000ZC0169,,,,,,,,,,,,,0,,,,,AB,terrains a bâtir,,,729,-0.534728,48.715536
2021-1027175,2021-05-19,000001,Vente,188500,13,,RUE JEAN DUMAS,0150,61440,61278,Messei,61,,,61278000AE0118,,,,,,,,,,,,,0,1,Maison,120,4,S,sols,,,804,-0.536093,48.712053
2021-1027175,2021-05-19,000001,Vente,188500,13,,RUE JEAN DUMAS,0150,61440,61278,Messei,61,,,61278000AE0118,,,,,,,,,,,,,0,3,Dépendance,,0,J,jardins,POTAG,Jardin potager,397,-0.536093,48.712053
2021-1027175,2021-05-19,000001,Vente,188500,13,,RUE JEAN DUMAS,0150,61440,61278,Messei,61,,,61278000AE0118,,,,,,,,,,,,,0,1,Maison,120,4,J,jardins,POTAG,Jardin potager,397,-0.536093,48.712053
2021-1027175,2021-05-19,000001,Vente,188500,13,,RUE JEAN DUMAS,0150,61440,61278,Messei,61,,,61278000AE0118,,,,,,,,,,,,,0,3,Dépendance,,0,S,sols,,,804,-0.536093,48.712053
2021-1027175,2021-05-19,000001,Vente,188500,,,LE BOURG-EST,B016,61440,61278,Messei,61,,,61278000AE0119,,,,,,,,,,,,,0,,,,,S,sols,,,90,-0.536274,48.711896
2021-1027241,2021-05-21,000001,Vente,38000,2,,LA VALLEE,B125,61440,61278,Messei,61,,,61278000ZD0156,,,,,,,,,,,,,0,1,Maison,82,4,AG,terrains d'agrément,PARC,Parc,1360,-0.542201,48.725431
2021-1027241,2021-05-21,000001,Vente,38000,2,,LA VALLEE,B125,61440,61278,Messei,61,,,61278000ZD0156,,,,,,,,,,,,,0,1,Maison,82,4,S,sols,,,1000,-0.542201,48.725431
2021-1027407,2021-06-11,000001,Vente,131610,,,LA MAIRERIE,B063,61440,61278,Messei,61,,,61278000ZN0068,,,,,,,,,,,,,0,,,,,P,prés,,,640,-0.57429,48.702525
2021-1027407,2021-06-11,000001,Vente,131610,,,LA MAIRERIE,B063,61440,61278,Messei,61,,,61278000ZN0069,,,,,,,,,,,,,0,,,,,S,sols,,,230,-0.574059,48.702653
2021-1027407,2021-06-11,000001,Vente,131610,24,,LA MAIRERIE,B063,61440,61278,Messei,61,,,61278000ZN0086,,,,,,,,,,,,,0,3,Dépendance,,0,S,sols,,,1000,-0.573494,48.702463
2021-1027407,2021-06-11,000001,Vente,131610,24,,LA MAIRERIE,B063,61440,61278,Messei,61,,,61278000ZN0086,,,,,,,,,,,,,0,3,Dépendance,,0,S,sols,,,1000,-0.573494,48.702463
2021-1027407,2021-06-11,000001,Vente,131610,24,,LA MAIRERIE,B063,61440,61278,Messei,61,,,61278000ZN0086,,,,,,,,,,,,,0,1,Maison,130,6,S,sols,,,1000,-0.573494,48.702463
2021-1027407,2021-06-11,000001,Vente,131610,24,,LA MAIRERIE,B063,61440,61278,Messei,61,,,61278000ZN0086,,,,,,,,,,,,,0,3,Dépendance,,0,VE,vergers,,,915,-0.573494,48.702463
2021-1027407,2021-06-11,000001,Vente,131610,24,,LA MAIRERIE,B063,61440,61278,Messei,61,,,61278000ZN0086,,,,,,,,,,,,,0,3,Dépendance,,0,VE,vergers,,,915,-0.573494,48.702463
2021-1027407,2021-06-11,000001,Vente,131610,24,,LA MAIRERIE,B063,61440,61278,Messei,61,,,61278000ZN0086,,,,,,,,,,,,,0,1,Maison,130,6,VE,vergers,,,915,-0.573494,48.702463
2021-1027414,2021-06-03,000002,Vente,10000,,,LA HELISIERE,B055,61440,61278,Messei,61,,,61278000ZO0143,,,,,,,,,,,,,0,,,,,T,terres,,,9555,-0.566818,48.710399
2021-1027418,2021-05-27,000001,Vente,15000,,,LA HELISIERE,B055,61440,61278,Messei,61,,,61278000ZO0013,,,,,,,,,,,,,0,,,,,P,prés,,,3160,-0.570667,48.709413
2021-1027635,2021-06-22,000001,Vente terrain à bâtir,24850,19,,RUE SIMONE VEIL,0330,61440,61278,Messei,61,,,61278000ZC0174,,,,,,,,,,,,,0,,,,,AB,terrains a bâtir,,,710,-0.533671,48.716017
2021-1027880,2021-06-19,000001,Vente,165000,5,,RUE DE LA CERISAIE,0030,61440,61278,Messei,61,,,61278000AH0067,,,,,,,,,,,,,0,1,Maison,155,4,S,sols,,,1188,-0.531474,48.710133
2021-1028649,2021-07-27,000001,Vente,24048,,,LA PIGNOCHE OUEST,B078,61440,61278,Messei,61,,,61278000ZL0086,,,,,,,,,,,,,0,,,,,S,sols,,,153,-0.53376,48.707458
2021-1028649,2021-07-27,000001,Vente,24048,1,,RUE ZA DU MOULIN,0164,61440,61278,Messei,61,,,61278000ZL0087,,,,,,,,,,,,,0,4,Local industriel. commercial ou assimilé,15,0,AG,terrains d'agrément,PARC,Parc,785,-0.53385,48.707467
2021-1028649,2021-07-27,000001,Vente,24048,1,,RUE ZA DU MOULIN,0164,61440,61278,Messei,61,,,61278000ZL0087,,,,,,,,,,,,,0,4,Local industriel. commercial ou assimilé,15,0,S,sols,,,1000,-0.53385,48.707467
2021-1028649,2021-07-27,000001,Vente,24048,,,LA PIGNOCHE OUEST,B078,61440,61278,Messei,61,,,61278000ZL0088,,,,,,,,,,,,,0,,,,,AB,terrains a bâtir,,,7,-0.534148,48.707508
2021-1028649,2021-07-27,000001,Vente,24048,,,RUE ZA DU MOULIN,0164,61440,61278,Messei,61,,,61278000ZL0091,,,,,,,,,,,,,0,,,,,S,sols,,,59,-0.533621,48.707063
2021-1029211,2021-08-12,000001,Vente,115000,7,,RUE DU CLOS PIOLET,0045,61440,61278,Messei,61,,,61278000AI0224,,,,,,,,,,,,,0,1,Maison,81,4,S,sols,,,975,-0.542917,48.710995
2021-1029307,2021-08-24,000001,Vente terrain à bâtir,23730,12,,RUE SIMONE VEIL,0330,61440,61278,Messei,61,,,61278000ZC0173,,,,,,,,,,,,,0,,,,,AB,terrains a bâtir,,,678,-0.533756,48.715686
2021-1029952,2021-09-21,000001,Vente terrain à bâtir,19670,2,,RUE SIMONE VEIL,0330,61440,61278,Messei,61,,,61278000AE0213,,,,,,,,,,,,,0,,,,,AB,terrains a bâtir,,,472,-0.535019,48.714983
2021-1029952,2021-09-21,000001,Vente terrain à bâtir,19670,,,LE PONT PLISSON,B084,61440,61278,Messei,61,,,61278000ZC0157,,,,,,,,,,,,,0,,,,,AB,terrains a bâtir,,,90,-0.534848,48.715064
2021-1030528,2021-10-13,000001,Vente,100000,15,,RUE DES GENETES,0113,61440,61278,Messei,61,,,61278000AK0012,,,,,,,,,,,,,0,1,Maison,47,3,J,jardins,POTAG,Jardin potager,506,-0.543281,48.717786
2021-1030528,2021-10-13,000001,Vente,100000,15,,RUE DES GENETES,0113,61440,61278,Messei,61,,,61278000AK0012,,,,,,,,,,,,,0,1,Maison,47,3,S,sols,,,363,-0.543281,48.717786
2021-1030763,2021-10-27,000001,Vente,1000,,,LA LANDRIERE,B060,61440,61278,Messei,61,,,61278000ZD0099,,,,,,,,,,,,,0,,,,,J,jardins,POTAG,Jardin potager,416,-0.530416,48.723547
2021-1031075,2021-11-16,000001,Vente,124500,8,,LE GUE,B051,61440,61278,Messei,61,,,61278000ZO0133,,,,,,,,,,,,,0,1,Maison,38,2,S,sols,,,620,-0.560245,48.710141
2021-1031075,2021-11-16,000001,Vente,124500,,,LE GUE,B051,61440,61278,Messei,61,,,61278000ZO0136,,,,,,,,,,,,,0,,,,,P,prés,,,45,-0.560204,48.710259
2021-1031076,2021-11-24,000001,Vente,800,,,LES GENETES,B047,61440,61278,Messei,61,,,61278000ZC0015,,,,,,,,,,,,,0,,,,,P,prés,,,3100,-0.540927,48.716075
2021-1031731,2021-12-14,000001,Vente,110000,16,,RUE JEAN MOULIN,0154,61440,61278,Messei,61,,,61278000AE0136,,,,,,,,,,,,,0,1,Maison,118,7,S,sols,,,720,-0.535437,48.714151
2021-1031989,2021-12-22,000001,Vente,206000,23,,RUE DES TISSERANDS,0327,61440,61278,Messei,61,,,61278000AH0028,,,,,,,,,,,,,0,1,Maison,115,5,S,sols,,,773,-0.534568,48.71113
2021-1032029,2021-12-29,000001,Vente,170000,9,,RUE JEAN-YVES HUET,0160,61440,61278,Messei,61,,,61278000ZC0134,,,,,,,,,,,,,0,1,Maison,109,4,S,sols,,,776,-0.538971,48.717761
2021-1032030,2021-12-29,000001,Vente,2000,,,LA LANDRIERE,B060,61440,61278,Messei,61,,,61278000ZD0139,,,,,,,,,,,,,0,,,,,P,prés,,,1639,-0.530819,48.722323
2021-1032167,2021-12-23,000002,Vente,12000,,,LES PRES DE LA LANDE,B088,61440,61278,Messei,61,,,61278000ZO0145,,,,,,,,,,,,,0,,,,,P,prés,,,24756,-0.557332,48.704662
2021-1032253,2021-12-27,000001,Vente,175000,,,BOIS DE LA LIVREE,B009,61440,61278,Messei,61,,,61278000ZM0002,,,,,,,,,,,,,0,,,,,P,prés,,,810,-0.559962,48.699173
2021-1032253,2021-12-27,000001,Vente,175000,25,,PLANCHES DE CROC,B083,61440,61278,Messei,61,,,61278000ZM0005,,,,,,,,,,,,,0,1,Maison,113,5,P,prés,,,3400,-0.56002,48.699697
2021-1032253,2021-12-27,000001,Vente,175000,25,,PLANCHES DE CROC,B083,61440,61278,Messei,61,,,61278000ZM0005,,,,,,,,,,,,,0,3,Dépendance,,0,P,prés,,,3400,-0.56002,48.699697
