id_mutation,date_mutation,numero_disposition,nature_mutation,valeur_fonciere,adresse_numero,adresse_suffixe,adresse_nom_voie,adresse_code_voie,code_postal,code_commune,nom_commune,code_departement,ancien_code_commune,ancien_nom_commune,id_parcelle,ancien_id_parcelle,numero_volume,lot1_numero,lot1_surface_carrez,lot2_numero,lot2_surface_carrez,lot3_numero,lot3_surface_carrez,lot4_numero,lot4_surface_carrez,lot5_numero,lot5_surface_carrez,nombre_lots,code_type_local,type_local,surface_reelle_bati,nombre_pieces_principales,code_nature_culture,nature_culture,code_nature_culture_speciale,nature_culture_speciale,surface_terrain,longitude,latitude
2021-1024244,2021-01-15,000001,Vente,27500,29,,RUE PIERRE DE ROMANET,0060,61130,61426,Saint-Martin-du-Vieux-Bellême,61,,,614260000C0063,,,,,,,,,,,,,0,1,Maison,60,1,S,sols,,,43,0.543619,48.38132
2021-1024418,2021-01-06,000001,Vente,400000,151,,LA FOUQUERIE,B181,61130,61426,Saint-Martin-du-Vieux-Bellême,61,,,614260000B0063,,,,,,,,,,,,,0,1,Maison,62,2,S,sols,,,2330,0.572118,48.386914
2021-1024418,2021-01-06,000001,Vente,400000,,,CHAMP DE DERRIERE,B045,61130,61426,Saint-Martin-du-Vieux-Bellême,61,,,614260000B0208,,,,,,,,,,,,,0,,,,,T,terres,,,758,0.571853,48.386993
2021-1024418,2021-01-06,000001,Vente,400000,,,LA FOUQUERIE,B181,61130,61426,Saint-Martin-du-Vieux-Bellême,61,,,614260000B0209,,,,,,,,,,,,,0,,,,,J,jardins,POTAG,Jardin potager,260,0.571859,48.386792
2021-1024432,2021-01-27,000001,Vente,19984.3,,,CHAMP DU GUE-DOLLANT,B083,61130,61426,Saint-Martin-du-Vieux-Bellême,61,,,614260000B0221,,,,,,,,,,,,,0,,,,,P,prés,,,28549,,
2021-1024716,2021-01-30,000001,Vente,92000,145,,LA POTERIE,B343,61130,61426,Saint-Martin-du-Vieux-Bellême,61,,,614260000B0027,,,,,,,,,,,,,0,1,Maison,80,3,S,sols,,,900,0.562784,48.384237
2021-1024744,2021-01-29,000001,Vente,13613,,,LA VALLEE,B408,61130,61426,Saint-Martin-du-Vieux-Bellême,61,,,614260000H0089,,,,,,,,,,,,,0,,,,,P,prés,,,5100,0.532823,48.354143
2021-1024744,2021-01-29,000001,Vente,13613,,,LA VALLEE,B408,61130,61426,Saint-Martin-du-Vieux-Bellême,61,,,614260000H0090,,,,,,,,,,,,,0,,,,,T,terres,,,10550,0.533806,48.35439
2021-1024744,2021-01-29,000001,Vente,13613,,,GROUAS MARTAU,B244,61130,61426,Saint-Martin-du-Vieux-Bellême,61,,,614260000H0092,,,,,,,,,,,,,0,,,,,T,terres,,,7070,0.534197,48.353814
2021-1024744,2021-01-29,000001,Vente,13613,,,GRANDE GROUAS,B210,61130,61426,Saint-Martin-du-Vieux-Bellême,61,,,614260000H0094,,,,,,,,,,,,,0,,,,,T,terres,,,11320,0.534359,48.353175
2021-1024755,2021-01-29,000001,Vente,60000,47,,RUE PIERRE DE ROMANET,0060,61130,61426,Saint-Martin-du-Vieux-Bellême,61,,,614260000C0034,,,,,,,,,,,,,0,1,Maison,54,3,S,sols,,,173,0.544722,48.381762
2021-1024755,2021-01-29,000001,Vente,60000,,,LE BOURG,B021,61130,61426,Saint-Martin-du-Vieux-Bellême,61,,,614260000C0035,,,,,,,,,,,,,0,,,,,S,sols,,,157,0.544686,48.38166
2021-1024755,2021-01-29,000001,Vente,60000,,,LE BOURG,B021,61130,61426,Saint-Martin-du-Vieux-Bellême,61,,,614260000C0036,,,,,,,,,,,,,0,,,,,S,sols,,,87,0.544568,48.381796
2021-1025276,2021-03-15,000001,Vente,2000,,,GROUAS DU POTIRON,B237,61130,61426,Saint-Martin-du-Vieux-Bellême,61,,,614260000F0059,,,,,,,,,,,,,0,,,,,T,terres,,,5220,0.5367,48.359449
2021-1025292,2021-03-03,000001,Vente,101283.13,,,LA RIDELLIERE,B386,61130,61426,Saint-Martin-du-Vieux-Bellême,61,,,614260000C0701,,,,,,,,,,,,,0,,,,,P,prés,,,10274,0.549747,48.383277
2021-1025292,2021-03-03,000001,Vente,101283.13,,,LA RIDELLIERE,B386,61130,61426,Saint-Martin-du-Vieux-Bellême,61,,,614260000C0701,,,,,,,,,,,,,0,,,,,P,prés,,,16549,0.549747,48.383277
2021-1025292,2021-03-03,000001,Vente,101283.13,,,LA RIDELLIERE,B386,61130,61426,Saint-Martin-du-Vieux-Bellême,61,,,614260000C0703,,,,,,,,,,,,,0,,,,,P,prés,,,16222,0.55074,48.384496
2021-1025292,2021-03-03,000001,Vente,101283.13,,,LA RIDELLIERE,B386,61130,61426,Saint-Martin-du-Vieux-Bellême,61,,,614260000C0703,,,,,,,,,,,,,0,,,,,P,prés,,,8112,0.55074,48.384496
2021-1025292,2021-03-03,000001,Vente,101283.13,,,LA RIDELLIERE,B386,61130,61426,Saint-Martin-du-Vieux-Bellême,61,,,614260000C0705,,,,,,,,,,,,,0,,,,,P,prés,,,7815,0.551619,48.384825
2021-1025292,2021-03-03,000001,Vente,101283.13,,,LA RIDELLIERE,B386,61130,61426,Saint-Martin-du-Vieux-Bellême,61,,,614260000C0705,,,,,,,,,,,,,0,,,,,P,prés,,,15628,0.551619,48.384825
2021-1025443,2021-03-11,000001,Vente,50000,,,L ECLOPCHARD,B166,61130,61426,Saint-Martin-du-Vieux-Bellême,61,,,614260000C0852,,,,,,,,,,,,,0,,,,,S,sols,,,920,,
2021-1026442,2021-04-26,000001,Vente,75000,236,,AUNAYE,B003,61130,61426,Saint-Martin-du-Vieux-Bellême,61,,,614260000E0021,,,,,,,,,,,,,0,1,Maison,66,3,S,sols,,,680,0.540914,48.367245
2021-1026442,2021-04-26,000001,Vente,75000,,,AUNAYE,B003,61130,61426,Saint-Martin-du-Vieux-Bellême,61,,,614260000E0022,,,,,,,,,,,,,0,,,,,S,sols,,,80,0.540978,48.367243
2021-1026546,2021-04-29,000001,Vente,21500,,,GRANDES PIECES,B221,61130,61426,Saint-Martin-du-Vieux-Bellême,61,,,614260000G0004,,,,,,,,,,,,,0,,,,,T,terres,,,12601,0.540211,48.356511
2021-1026546,2021-04-29,000001,Vente,21500,,,GRANDES PIECES,B221,61130,61426,Saint-Martin-du-Vieux-Bellême,61,,,614260000G0004,,,,,,,,,,,,,0,,,,,T,terres,,,12601,0.540211,48.356511
2021-1026556,2021-04-29,000001,Vente,16381.3,,,GRANDES PIECES,B221,61130,61426,Saint-Martin-du-Vieux-Bellême,61,,,614260000G0004,,,,,,,,,,,,,0,,,,,T,terres,,,12601,0.540211,48.356511
2021-1026556,2021-04-29,000001,Vente,16381.3,,,GRANDES PIECES,B221,61130,61426,Saint-Martin-du-Vieux-Bellême,61,,,614260000G0004,,,,,,,,,,,,,0,,,,,T,terres,,,12601,0.540211,48.356511
2021-1026781,2021-04-30,000001,Vente,13000,31,,RUE PIERRE DE ROMANET,0060,61130,61426,Saint-Martin-du-Vieux-Bellême,61,,,614260000C0062,,,,,,,,,,,,,0,1,Maison,30,1,S,sols,,,100,0.543703,48.381324
2021-1027073,2021-05-12,000001,Vente,138000,13,,LOT DES TILLEULS,A003,61130,61426,Saint-Martin-du-Vieux-Bellême,61,,,614260000C0489,,,,,,,,,,,,,0,1,Maison,73,4,S,sols,,,523,0.550367,48.37934
2021-1027140,2021-05-11,000001,Vente,23400,,,CHAMP DE L ORMEAU,B050,61130,61426,Saint-Martin-du-Vieux-Bellême,61,,,614260000G0253,,,,,,,,,,,,,0,,,,,T,terres,,,2340,0.561825,48.364289
2021-1027150,2021-05-15,000001,Vente,50000,135,,LES TROIS COINS,B406,61130,61426,Saint-Martin-du-Vieux-Bellême,61,,,614260000C0369,,,,,,,,,,,,,0,1,Maison,64,4,J,jardins,POTAG,Jardin potager,525,0.554753,48.378499
2021-1027150,2021-05-15,000001,Vente,50000,135,,LES TROIS COINS,B406,61130,61426,Saint-Martin-du-Vieux-Bellême,61,,,614260000C0369,,,,,,,,,,,,,0,1,Maison,64,4,S,sols,,,240,0.554753,48.378499
2021-1027521,2021-06-18,000001,Vente,178000,26,,LA BRUYERE,B023,61130,61426,Saint-Martin-du-Vieux-Bellême,61,,,614260000C0215,,,,,,,,,,,,,0,1,Maison,60,2,S,sols,,,407,0.545393,48.386787
2021-1027521,2021-06-18,000001,Vente,178000,,,LA BRUYERE,B023,61130,61426,Saint-Martin-du-Vieux-Bellême,61,,,614260000C0528,,,,,,,,,,,,,0,,,,,S,sols,,,98,0.5455,48.386881
2021-1027859,2021-06-21,000003,Vente,68000,,,LES FONTAINES,B180,61130,61426,Saint-Martin-du-Vieux-Bellême,61,,,614260000E0074,,,,,,,,,,,,,0,,,,,P,prés,,,9570,0.540718,48.36271
2021-1027859,2021-06-21,000003,Vente,68000,,,LA VALLEE,B408,61130,61426,Saint-Martin-du-Vieux-Bellême,61,,,614260000E0084,,,,,,,,,,,,,0,,,,,P,prés,,,10210,0.541334,48.361572
2021-1027859,2021-06-21,000003,Vente,68000,,,PETIT CHAMP,B305,61130,61426,Saint-Martin-du-Vieux-Bellême,61,,,614260000E0086,,,,,,,,,,,,,0,,,,,P,prés,,,2350,0.541227,48.360522
2021-1027859,2021-06-21,000003,Vente,68000,,,LE TURET,B407,61130,61426,Saint-Martin-du-Vieux-Bellême,61,,,614260000E0087,,,,,,,,,,,,,0,,,,,P,prés,,,7920,0.541742,48.359623
2021-1027859,2021-06-21,000003,Vente,68000,,,LA VALLEE,B408,61130,61426,Saint-Martin-du-Vieux-Bellême,61,,,614260000E0088,,,,,,,,,,,,,0,,,,,L,landes,FRICH,Friche,3070,0.540978,48.35967
2021-1027859,2021-06-21,000003,Vente,68000,,,LA VALLEE,B408,61130,61426,Saint-Martin-du-Vieux-Bellême,61,,,614260000E0089,,,,,,,,,,,,,0,,,,,P,prés,,,4700,0.540782,48.360135
2021-1027859,2021-06-21,000003,Vente,68000,,,L OUCHE,B290,61130,61426,Saint-Martin-du-Vieux-Bellême,61,,,614260000E0091,,,,,,,,,,,,,0,,,,,T,terres,,,12360,0.539903,48.360785
2021-1027859,2021-06-21,000003,Vente,68000,,,LA VALLEE,B408,61130,61426,Saint-Martin-du-Vieux-Bellême,61,,,614260000E0092,,,,,,,,,,,,,0,,,,,T,terres,,,26230,0.539001,48.359797
2021-1027859,2021-06-21,000003,Vente,68000,,,LE PENDANT,B302,61130,61426,Saint-Martin-du-Vieux-Bellême,61,,,614260000E0093,,,,,,,,,,,,,0,,,,,T,terres,,,23830,0.539566,48.358873
2021-1027859,2021-06-21,000003,Vente,68000,,,CLOS DE VAUDRON,B128,61130,61426,Saint-Martin-du-Vieux-Bellême,61,,,614260000E0098,,,,,,,,,,,,,0,,,,,T,terres,,,19530,0.538549,48.361661
2021-1027859,2021-06-21,000003,Vente,68000,,,LA GRANDE GROUAS,B211,61130,61426,Saint-Martin-du-Vieux-Bellême,61,,,614260000E0196,,,,,,,,,,,,,0,,,,,T,terres,,,970,0.538084,48.360298
2021-1027859,2021-06-21,000003,Vente,68000,,,GRAND CLOS,B196,61130,61426,Saint-Martin-du-Vieux-Bellême,61,,,614260000E0251,,,,,,,,,,,,,0,,,,,P,prés,,,8205,0.540165,48.365358
2021-1027859,2021-06-21,000003,Vente,68000,,,LA VIGNE,B423,61130,61426,Saint-Martin-du-Vieux-Bellême,61,,,614260000E0254,,,,,,,,,,,,,0,,,,,P,prés,,,760,0.539834,48.364805
2021-1027859,2021-06-21,000003,Vente,68000,,,PRE NEUF,B377,61130,61426,Saint-Martin-du-Vieux-Bellême,61,,,614260000E0256,,,,,,,,,,,,,0,,,,,P,prés,,,4850,0.540331,48.364439
2021-1027859,2021-06-21,000003,Vente,68000,,,LE PRE,B345,61130,61426,Saint-Martin-du-Vieux-Bellême,61,,,614260000E0259,,,,,,,,,,,,,0,,,,,P,prés,,,1560,0.540381,48.363844
2021-1027859,2021-06-21,000003,Vente,68000,,,LES FRICHES,B182,61130,61426,Saint-Martin-du-Vieux-Bellême,61,,,614260000E0320,,,,,,,,,,,,,0,,,,,P,prés,,,5552,0.542506,48.359738
2021-1027859,2021-06-21,000003,Vente,68000,,,LES FRICHES,B182,61130,61426,Saint-Martin-du-Vieux-Bellême,61,,,614260000E0322,,,,,,,,,,,,,0,,,,,P,prés,,,2275,0.541893,48.360115
2021-1027859,2021-06-21,000003,Vente,68000,,,CLOS DE VAUDRON,B128,61130,61426,Saint-Martin-du-Vieux-Bellême,61,,,614260000E0323,,,,,,,,,,,,,0,,,,,P,prés,,,8408,0.538534,48.362527
2021-1027859,2021-06-21,000003,Vente,68000,,,VAUDRON,B412,61130,61426,Saint-Martin-du-Vieux-Bellême,61,,,614260000E0325,,,,,,,,,,,,,0,,,,,J,jardins,POTAG,Jardin potager,441,0.538445,48.363315
2021-1028059,2021-07-09,000001,Vente,26994,,,LE GRAND PRE,B204,61130,61426,Saint-Martin-du-Vieux-Bellême,61,,,614260000E0130,,,,,,,,,,,,,0,,,,,P,prés,,,15140,0.538614,48.368615
2021-1028059,2021-07-09,000001,Vente,26994,,,LE PATURAS,B296,61130,61426,Saint-Martin-du-Vieux-Bellême,61,,,614260000E0138,,,,,,,,,,,,,0,,,,,P,prés,,,33820,0.540619,48.369644
2021-1028059,2021-07-09,000001,Vente,26994,,,LE PATURAS,B296,61130,61426,Saint-Martin-du-Vieux-Bellême,61,,,614260000E0165,,,,,,,,,,,,,0,,,,,L,landes,FRICH,Friche,120,0.540674,48.370387
2021-1028080,2021-06-30,000001,Vente,120000,40,,RUE PIERRE DE ROMANET,0060,61130,61426,Saint-Martin-du-Vieux-Bellême,61,,,614260000C0164,,,,,,,,,,,,,0,1,Maison,66,3,S,sols,,,188,0.543402,48.381678
2021-1028080,2021-06-30,000001,Vente,120000,40,,RUE PIERRE DE ROMANET,0060,61130,61426,Saint-Martin-du-Vieux-Bellême,61,,,614260000C0165,,,,,,,,,,,,,0,,,,,S,sols,,,49,0.543488,48.38161
2021-1028080,2021-06-30,000001,Vente,120000,42,,RUE PIERRE DE ROMANET,0060,61130,61426,Saint-Martin-du-Vieux-Bellême,61,,,614260000C0166,,,,,,,,,,,,,0,,,,,S,sols,,,40,0.543565,48.381573
2021-1028080,2021-06-30,000001,Vente,120000,,,LE BOURG,B021,61130,61426,Saint-Martin-du-Vieux-Bellême,61,,,614260000C0167,,,,,,,,,,,,,0,,,,,S,sols,,,80,0.543536,48.381662
2021-1028080,2021-06-30,000001,Vente,120000,,,LE BOURG,B021,61130,61426,Saint-Martin-du-Vieux-Bellême,61,,,614260000C0804,,,,,,,,,,,,,0,,,,,S,sols,,,18,0.543518,48.381559
2021-1029215,2021-08-28,000001,Vente,186850,4,,RUE MAURICE DE VLAMINCK,0071,61130,61426,Saint-Martin-du-Vieux-Bellême,61,,,614260000D0300,,,,,,,,,,,,,0,1,Maison,89,4,S,sols,,,783,0.552653,48.375012
2021-1029636,2021-09-02,000001,Vente,55000,42,,LE BOURG,B021,61130,61426,Saint-Martin-du-Vieux-Bellême,61,,,614260000C0142,,,,,,,,,,,,,0,3,Dépendance,,0,S,sols,,,60,0.543216,48.381025
2021-1029636,2021-09-02,000001,Vente,55000,24,,RUE PIERRE DE ROMANET,0060,61130,61426,Saint-Martin-du-Vieux-Bellême,61,,,614260000C0144,,,,,,,,,,,,,0,1,Maison,70,2,S,sols,,,105,0.543299,48.381047
2021-1029685,2021-09-14,000001,Vente terrain à bâtir,32542,25,,LOT L'OREE DU GOLF,A004,61130,61426,Saint-Martin-du-Vieux-Bellême,61,,,614260000D0665,,,,,,,,,,,,,0,,,,,AB,terrains a bâtir,,,859,0.550103,48.374712
2021-1029843,2021-09-15,000001,Vente,70000,,,LE BOURG,B021,61130,61426,Saint-Martin-du-Vieux-Bellême,61,,,614260000C0106,,,,,,,,,,,,,0,,,,,S,sols,,,1093,0.541767,48.380097
2021-1029843,2021-09-15,000001,Vente,70000,,,LE BOURG,B021,61130,61426,Saint-Martin-du-Vieux-Bellême,61,,,614260000C0120,,,,,,,,,,,,,0,,,,,J,jardins,POTAG,Jardin potager,183,0.541774,48.380407
2021-1029843,2021-09-15,000001,Vente,70000,5,,RUE DES CROISETTES,0063,61130,61426,Saint-Martin-du-Vieux-Bellême,61,,,614260000C0816,,,,,,,,,,,,,0,1,Maison,73,3,S,sols,,,64,0.541931,48.380291
2021-1029843,2021-09-15,000001,Vente,70000,5,,RUE DES CROISETTES,0063,61130,61426,Saint-Martin-du-Vieux-Bellême,61,,,614260000C0816,,,,,,,,,,,,,0,3,Dépendance,,0,S,sols,,,64,0.541931,48.380291
2021-1029843,2021-09-15,000001,Vente,70000,,,LES CROISETTES,B152,61130,61426,Saint-Martin-du-Vieux-Bellême,61,,,614260000C0817,,,,,,,,,,,,,0,,,,,S,sols,,,20,0.541806,48.380371
2021-1030069,2021-09-27,000001,Vente,44220,1,,LOT L'OREE DU GOLF,A004,61130,61426,Saint-Martin-du-Vieux-Bellême,61,,,614260000D0677,,,,,,,,,,,,,0,,,,,AB,terrains a bâtir,,,1228,0.548435,48.373136
2021-1030240,2021-10-08,000001,Vente,75000,139,,PRE DE LA GRANGE,B355,61130,61426,Saint-Martin-du-Vieux-Bellême,61,,,614260000C0363,,,,,,,,,,,,,0,1,Maison,77,4,S,sols,,,823,0.554427,48.379008
2021-1030285,2021-10-01,000001,Vente,87000,124,,LA MALADRIE LES CASTORS,B269,61130,61426,Saint-Martin-du-Vieux-Bellême,61,,,614260000D0101,,,,,,,,,,,,,0,3,Dépendance,,0,S,sols,,,420,0.550713,48.376158
2021-1030285,2021-10-01,000001,Vente,87000,124,,LA MALADRIE LES CASTORS,B269,61130,61426,Saint-Martin-du-Vieux-Bellême,61,,,614260000D0101,,,,,,,,,,,,,0,1,Maison,89,8,S,sols,,,420,0.550713,48.376158
2021-1030444,2021-10-29,000002,Vente,488,,,LA RIDELLIERE,B386,61130,61426,Saint-Martin-du-Vieux-Bellême,61,,,614260000C0904,,,,,,,,,,,,,0,,,,,P,prés,,,690,0.549919,48.382243
2021-1030644,2021-10-15,000001,Vente,39000,7,,LOT L'OREE DU GOLF,A004,61130,61426,Saint-Martin-du-Vieux-Bellême,61,,,614260000D0674,,,,,,,,,,,,,0,,,,,AB,terrains a bâtir,,,941,0.549001,48.373965
2021-1030647,2021-10-16,000001,Vente,175200,315,,LE GRAND CHAMP,B192,61130,61426,Saint-Martin-du-Vieux-Bellême,61,,,614260000C0657,,,,,,,,,,,,,0,1,Maison,88,4,S,sols,,,781,0.534757,48.376964
2021-1030647,2021-10-16,000001,Vente,175200,315,,LE GRAND CHAMP,B192,61130,61426,Saint-Martin-du-Vieux-Bellême,61,,,614260000C0657,,,,,,,,,,,,,0,1,Maison,88,4,AG,terrains d'agrément,PARC,Parc,2149,0.534757,48.376964
2021-1031014,2021-11-26,000002,Vente,1188,,,LA RIDELLIERE,B386,61130,61426,Saint-Martin-du-Vieux-Bellême,61,,,614260000C0871,,,,,,,,,,,,,0,,,,,P,prés,,,848,0.550666,48.382245
2021-1031120,2021-11-09,000001,Vente,75000,,,LE BOURG,B021,61130,61426,Saint-Martin-du-Vieux-Bellême,61,,,614260000C0048,,,,,,,,,,,,,0,,,,,J,jardins,POTAG,Jardin potager,152,0.544848,48.381068
2021-1031120,2021-11-09,000001,Vente,75000,,,LE BOURG,B021,61130,61426,Saint-Martin-du-Vieux-Bellême,61,,,614260000C0059,,,,,,,,,,,,,0,,,,,J,jardins,POTAG,Jardin potager,128,0.543873,48.381255
2021-1031120,2021-11-09,000001,Vente,75000,34,,LE BOURG,B021,61130,61426,Saint-Martin-du-Vieux-Bellême,61,,,614260000C0060,,,,,,,,,,,,,0,3,Dépendance,,0,S,sols,,,63,0.543783,48.381302
2021-1031120,2021-11-09,000001,Vente,75000,34,,LE BOURG,B021,61130,61426,Saint-Martin-du-Vieux-Bellême,61,,,614260000C0060,,,,,,,,,,,,,0,3,Dépendance,,0,S,sols,,,63,0.543783,48.381302
2021-1031120,2021-11-09,000001,Vente,75000,34,,LE BOURG,B021,61130,61426,Saint-Martin-du-Vieux-Bellême,61,,,614260000C0060,,,,,,,,,,,,,0,3,Dépendance,,0,S,sols,,,63,0.543783,48.381302
2021-1031120,2021-11-09,000001,Vente,75000,33,,RUE PIERRE DE ROMANET,0060,61130,61426,Saint-Martin-du-Vieux-Bellême,61,,,614260000C0061,,,,,,,,,,,,,0,1,Maison,95,3,S,sols,,,65,0.543676,48.38141
2021-1031120,2021-11-09,000001,Vente,75000,31,,RUE PIERRE DE ROMANET,0060,61130,61426,Saint-Martin-du-Vieux-Bellême,61,,,614260000C0062,,,,,,,,,,,,,0,1,Maison,30,1,S,sols,,,100,0.543703,48.381324
2021-1031283,2021-11-26,000001,Vente,15000,,,PRE DE CICE,B349,61130,61426,Saint-Martin-du-Vieux-Bellême,61,,,614260000F0031,,,,,,,,,,,,,0,,,,,BP,peupleraies,,,13720,0.528616,48.362791
2021-1031283,2021-11-26,000001,Vente,15000,,,PRE DE CICE,B349,61130,61426,Saint-Martin-du-Vieux-Bellême,61,,,614260000F0043,,,,,,,,,,,,,0,,,,,P,prés,,,635,0.530428,48.362106
2021-1031522,2021-12-02,000001,Vente terrain à bâtir,68380,4,,LOT L'OREE DU GOLF,A004,61130,61426,Saint-Martin-du-Vieux-Bellême,61,,,614260000D0656,,,,,,,,,,,,,0,,,,,AB,terrains a bâtir,,,953,0.548395,48.374021
2021-1031522,2021-12-02,000001,Vente terrain à bâtir,68380,2,,LOT L'OREE DU GOLF,A004,61130,61426,Saint-Martin-du-Vieux-Bellême,61,,,614260000D0657,,,,,,,,,,,,,0,,,,,AB,terrains a bâtir,,,944,0.54847,48.373772
2021-1031570,2021-12-14,000001,Vente,220000,301,,LA MALADRIE,B268,61130,61426,Saint-Martin-du-Vieux-Bellême,61,,,614260000D0527,,,,,,,,,,,,,0,1,Maison,115,4,S,sols,,,353,0.550156,48.375621
2021-1031570,2021-12-14,000001,Vente,220000,301,,LA MALADRIE,B268,61130,61426,Saint-Martin-du-Vieux-Bellême,61,,,614260000D0527,,,,,,,,,,,,,0,3,Dépendance,,0,S,sols,,,353,0.550156,48.375621
2021-1031570,2021-12-14,000001,Vente,220000,301,,LA MALADRIE,B268,61130,61426,Saint-Martin-du-Vieux-Bellême,61,,,614260000D0527,,,,,,,,,,,,,0,3,Dépendance,,0,S,sols,,,353,0.550156,48.375621
2021-1031570,2021-12-14,000001,Vente,220000,,,LA MALADRIE,B268,61130,61426,Saint-Martin-du-Vieux-Bellême,61,,,614260000D0530,,,,,,,,,,,,,0,,,,,S,sols,,,1015,0.550257,48.375545
2021-1032023,2021-12-28,000001,Vente,30000,,,SECHE-TERRE,B394,61130,61426,Saint-Martin-du-Vieux-Bellême,61,,,614260000G0083,,,,,,,,,,,,,0,,,,,S,sols,,,96,0.557549,48.359527
2021-1032023,2021-12-28,000001,Vente,30000,,,SECHE-TERRE,B394,61130,61426,Saint-Martin-du-Vieux-Bellême,61,,,614260000G0084,,,,,,,,,,,,,0,,,,,S,sols,,,270,0.557555,48.359449
2021-1032325,2021-04-07,000001,Vente,55000,,,LE BOURG,B021,61130,61426,Saint-Martin-du-Vieux-Bellême,61,,,614260000C0066,,,,,,,,,,,,,0,,,,,S,sols,,,123,0.543676,48.381172
2021-1032325,2021-04-07,000001,Vente,55000,67,,LE BOURG,B021,61130,61426,Saint-Martin-du-Vieux-Bellême,61,,,614260000C0067,,,,,,,,,,,,,0,1,Maison,25,2,S,sols,,,223,0.543888,48.381108
