id_mutation,date_mutation,numero_disposition,nature_mutation,valeur_fonciere,adresse_numero,adresse_suffixe,adresse_nom_voie,adresse_code_voie,code_postal,code_commune,nom_commune,code_departement,ancien_code_commune,ancien_nom_commune,id_parcelle,ancien_id_parcelle,numero_volume,lot1_numero,lot1_surface_carrez,lot2_numero,lot2_surface_carrez,lot3_numero,lot3_surface_carrez,lot4_numero,lot4_surface_carrez,lot5_numero,lot5_surface_carrez,nombre_lots,code_type_local,type_local,surface_reelle_bati,nombre_pieces_principales,code_nature_culture,nature_culture,code_nature_culture_speciale,nature_culture_speciale,surface_terrain,longitude,latitude
2021-1055302,2021-01-15,000001,Vente,141150,12,,AV DU GENERAL DE GAULLE,0750,62600,62108,Berck,62,,,62108000CM0301,,,40,,,,,,,,,,1,2,Appartement,83,4,,,,,,1.566947,50.407987
2021-1055302,2021-01-15,000001,Vente,141150,12,,AV DU GENERAL DE GAULLE,0750,62600,62108,Berck,62,,,62108000CM0301,,,34,,,,,,,,,,1,3,Dépendance,,0,,,,,,1.566947,50.407987
2021-1055308,2021-01-14,000001,Vente,206000,48,,RUE DU CALVAIRE,0320,62600,62108,Berck,62,,,62108000CL0328,,,,,,,,,,,,,0,1,Maison,86,5,S,sols,,,65,1.561803,50.40742
2021-1055313,2021-01-14,000001,Vente,87000,1,,RES BLEU MARINE AVE DR FOUCHET,A080,62600,62108,Berck,62,,,62108000CN0453,,,25,,,,,,,,,,1,3,Dépendance,,0,,,,,,1.56766,50.411218
2021-1055313,2021-01-14,000001,Vente,87000,1,,RES BLEU MARINE AVE DR FOUCHET,A080,62600,62108,Berck,62,,,62108000CN0453,,,6,,,,,,,,,,1,2,Appartement,28,2,,,,,,1.56766,50.411218
2021-1055316,2021-01-09,000001,Vente,165060,63,,RUE DE L IMPERATRICE,0860,62600,62108,Berck,62,,,62108000CI0169,,,,,,,,,,,,,0,4,Local industriel. commercial ou assimilé,62,0,S,sols,,,164,1.568109,50.405432
2021-1055316,2021-01-09,000001,Vente,165060,63,,RUE DE L IMPERATRICE,0860,62600,62108,Berck,62,,,62108000CI0169,,,,,,,,,,,,,0,2,Appartement,41,2,S,sols,,,164,1.568109,50.405432
2021-1055316,2021-01-09,000001,Vente,165060,63,,RUE DE L IMPERATRICE,0860,62600,62108,Berck,62,,,62108000CI0169,,,,,,,,,,,,,0,2,Appartement,43,2,S,sols,,,164,1.568109,50.405432
2021-1055321,2021-01-18,000001,Vente,162450,4,,RUE SAINT GEORGES,1620,62600,62108,Berck,62,,,62108000CK0166,,,,,,,,,,,,,0,1,Maison,76,5,S,sols,,,57,1.562655,50.405652
2021-1055324,2021-01-14,000001,Vente,95000,3,,AV DU HUIT MAI 1945,0855,62600,62108,Berck,62,,,62108000BH0060,,,203,,,,,,,,,,1,3,Dépendance,,0,,,,,,1.579511,50.404029
2021-1055324,2021-01-14,000001,Vente,95000,3,,AV DU HUIT MAI 1945,0855,62600,62108,Berck,62,,,62108000BH0060,,,3,,,,,,,,,,1,2,Appartement,63,3,,,,,,1.579511,50.404029
2021-1055333,2021-01-19,000001,Vente,150000,5,B,RUE GABRIEL PERI,0700,62600,62108,Berck,62,,,62108000CI0162,,,10,,,,,,,,,,1,2,Appartement,50,2,,,,,,1.568084,50.405704
2021-1055333,2021-01-19,000001,Vente,150000,5,B,RUE GABRIEL PERI,0700,62600,62108,Berck,62,,,62108000CI0162,,,9,,,,,,,,,,1,2,Appartement,42,2,,,,,,1.568084,50.405704
2021-1055333,2021-01-19,000001,Vente,150000,5,B,RUE GABRIEL PERI,0700,62600,62108,Berck,62,,,62108000CI0162,,,17,,,,,,,,,,1,3,Dépendance,,0,,,,,,1.568084,50.405704
2021-1055333,2021-01-19,000001,Vente,150000,5,B,RUE GABRIEL PERI,0700,62600,62108,Berck,62,,,62108000CI0162,,,14,,,,,,,,,,1,3,Dépendance,,0,,,,,,1.568084,50.405704
2021-1055342,2021-01-07,000001,Vente,235700,3,,ALL DU MOULIN BAILLY,1154,62600,62108,Berck,62,,,62108000AO0268,,,,,,,,,,,,,0,1,Maison,89,5,S,sols,,,480,1.574708,50.415694
2021-1055345,2021-01-09,000001,Vente,257000,19,,RUE DES FRERES MOZER,0685,62600,62108,Berck,62,,,62108000BN0020,,,,,,,,,,,,,0,1,Maison,122,5,S,sols,,,357,1.565352,50.400576
2021-1055356,2021-01-21,000001,Vente,80000,45,,RUE DES MINES D OR,1090,62600,62108,Berck,62,,,62108000BE0136,,,,,,,,,,,,,0,1,Maison,64,3,S,sols,,,109,1.588226,50.407802
2021-1055357,2021-01-26,000001,Vente,215750,57,,RUE DES PATRES,1340,62600,62108,Berck,62,,,62108000AZ0136,,,,,,,,,,,,,0,1,Maison,67,4,S,sols,,,552,1.588287,50.404452
2021-1055373,2021-01-14,000001,Vente,750000,9007,,RUE DE LA PLAGE,1435,62600,62108,Berck,62,,,62108000CI0119,,,,,,,,,,,,,0,4,Local industriel. commercial ou assimilé,1521,0,S,sols,,,776,1.566156,50.40735
2021-1055373,2021-01-14,000001,Vente,750000,,,RUE DE LA PLAGE,1435,62600,62108,Berck,62,,,62108000CI0120,,,,,,,,,,,,,0,,,,,S,sols,,,745,1.56583,50.407292
2021-1055377,2021-01-25,000001,Vente,73000,9,,RUE SINGER,1730,62600,62108,Berck,62,,,62108000CI0085,,,23,32.7,35,,,,,,,,2,2,Appartement,30,1,,,,,,1.564352,50.40767
2021-1055380,2021-01-18,000001,Vente,100200,32,,RUE LEONIE DUPLAIX,0940,62600,62108,Berck,62,,,62108000BT0424,,,6,,,,,,,,,,1,3,Dépendance,,0,,,,,,1.567376,50.40327
2021-1055380,2021-01-18,000001,Vente,100200,32,,RUE LEONIE DUPLAIX,0940,62600,62108,Berck,62,,,62108000BT0424,,,2,,5,,,,,,,,2,2,Appartement,38,2,,,,,,1.567376,50.40327
2021-1055381,2021-01-22,000001,Vente,70000,57,,RUE DE L IMPERATRICE,0860,62600,62108,Berck,62,,,62108000CI0376,,,4,53.2,,,,,,,,,1,2,Appartement,56,3,,,,,,1.567492,50.405263
2021-1055408,2021-01-23,000001,Vente,16000,64,,RUE DU HAUT BANC,0820,62600,62108,Berck,62,,,62108000BX0025,,,24,,,,,,,,,,1,3,Dépendance,,0,,,,,,1.580698,50.405964
2021-1055419,2021-01-19,000001,Vente,58000,2,,RUE DES PATRONS,1350,62600,62108,Berck,62,,,62108000BE0129,,,4,,,,,,,,,,1,1,Maison,42,2,,,,,,1.58788,50.408176
2021-1055427,2021-01-11,000001,Vente,15000,26,,RUE DE L ABBE VANDEWALLE,0010,62600,62108,Berck,62,,,62108000BE0037,,,,,,,,,,,,,0,1,Maison,78,5,J,jardins,POTAG,Jardin potager,255,1.5846,50.405095
2021-1055429,2021-01-08,000001,Vente,77000,56,,RES CAP SOLEIL,A087,62600,62108,Berck,62,,,62108000CL0439,,,15,,,,,,,,,,1,3,Dépendance,,0,,,,,,1.5624,50.408635
2021-1055429,2021-01-08,000001,Vente,77000,56,,RES CAP SOLEIL,A087,62600,62108,Berck,62,,,62108000CL0439,,,1,,,,,,,,,,1,2,Appartement,24,1,,,,,,1.5624,50.408635
2021-1055487,2021-01-14,000001,Vente,218000,3,,RUE DOCTEUR VICTOR MENARD,0520,62600,62108,Berck,62,,,62108000BR0099,,,,,,,,,,,,,0,3,Dépendance,,0,S,sols,,,155,1.56313,50.404404
2021-1055487,2021-01-14,000001,Vente,218000,3,,RUE DOCTEUR VICTOR MENARD,0520,62600,62108,Berck,62,,,62108000BR0099,,,,,,,,,,,,,0,2,Appartement,96,5,S,sols,,,155,1.56313,50.404404
2021-1055487,2021-01-14,000001,Vente,218000,3,,RUE DOCTEUR VICTOR MENARD,0520,62600,62108,Berck,62,,,62108000BR0099,,,,,,,,,,,,,0,4,Local industriel. commercial ou assimilé,60,0,S,sols,,,155,1.56313,50.404404
2021-1055487,2021-01-14,000001,Vente,218000,3,,RUE DOCTEUR VICTOR MENARD,0520,62600,62108,Berck,62,,,62108000BR0099,,,,,,,,,,,,,0,4,Local industriel. commercial ou assimilé,84,0,S,sols,,,155,1.56313,50.404404
2021-1055488,2021-01-14,000001,Vente,150000,,,AU CHEMIN BARBIER,B006,62600,62108,Berck,62,,,62108000AD0162,,,,,,,,,,,,,0,,,,,AG,terrains d'agrément,,,193,1.605299,50.412878
2021-1055488,2021-01-14,000001,Vente,150000,9006,,CHE DE LA SANTE,1700,62600,62108,Berck,62,,,62108000AD0167,,,,,,,,,,,,,0,1,Maison,77,5,S,sols,,,572,1.605221,50.413094
2021-1055489,2021-01-15,000001,Vente,300000,,,RUE EMILE LAVEZZARI,0560,62600,62108,Berck,62,,,62108000BH0045,,,,,,,,,,,,,0,,,,,J,jardins,POTAG,Jardin potager,1065,1.576903,50.40399
2021-1055489,2021-01-15,000001,Vente,300000,61,,RUE EMILE LAVEZZARI,0560,62600,62108,Berck,62,,,62108000BH0046,,,,,,,,,,,,,0,1,Maison,128,7,J,jardins,POTAG,Jardin potager,631,1.576945,50.404386
2021-1055489,2021-01-15,000001,Vente,300000,61,,RUE EMILE LAVEZZARI,0560,62600,62108,Berck,62,,,62108000BH0046,,,,,,,,,,,,,0,1,Maison,128,7,S,sols,,,574,1.576945,50.404386
2021-1055489,2021-01-15,000001,Vente,300000,61,,RUE EMILE LAVEZZARI,0560,62600,62108,Berck,62,,,62108000BH0135,,,,,,,,,,,,,0,,,,,S,sols,,,1,1.576935,50.404458
2021-1055490,2021-01-21,000001,Vente,130000,70,,RUE CARNOT,0330,62600,62108,Berck,62,,,62108000CI0266,,,25,,,,,,,,,,1,2,Appartement,80,4,,,,,,1.565233,50.407224
2021-1055490,2021-01-21,000001,Vente,130000,70,,RUE CARNOT,0330,62600,62108,Berck,62,,,62108000CI0266,,,35,,,,,,,,,,1,3,Dépendance,,0,,,,,,1.565233,50.407224
2021-1055491,2021-01-29,000001,Vente,109500,9001,,RES APOLLO AV MARIANNE,A691,62600,62108,Berck,62,,,62108000BP0027,,,235,,,,,,,,,,1,2,Appartement,27,1,,,,,,1.559312,50.403922
2021-1055492,2021-01-22,000001,Vente,140000,7,,RUE CLOVIS,0390,62600,62108,Berck,62,,,62108000BV0101,,,,,,,,,,,,,0,1,Maison,74,3,S,sols,,,90,1.574219,50.405658
2021-1055493,2021-01-27,000001,Vente,126500,32,,RUE DES MINES D OR,1090,62600,62108,Berck,62,,,62108000BE0179,,,,,,,,,,,,,0,1,Maison,26,2,S,sols,,,143,1.587703,50.407289
2021-1055503,2021-02-03,000001,Vente,76000,3,,RUE DU HAUT BANC,0820,62600,62108,Berck,62,,,62108000BW0271,,,14,,,,,,,,,,1,4,Local industriel. commercial ou assimilé,10,0,,,,,,1.577609,50.406627
2021-1055503,2021-02-03,000001,Vente,76000,3,,RUE DU HAUT BANC,0820,62600,62108,Berck,62,,,62108000BW0271,,,13,,,,,,,,,,1,4,Local industriel. commercial ou assimilé,10,0,,,,,,1.577609,50.406627
2021-1055503,2021-02-03,000001,Vente,76000,3,,RUE DU HAUT BANC,0820,62600,62108,Berck,62,,,62108000BW0271,,,1,115.05,,,,,,,,,1,4,Local industriel. commercial ou assimilé,117,0,,,,,,1.577609,50.406627
2021-1055507,2021-01-18,000001,Vente,271000,37,,BD DE PARIS,1310,62600,62108,Berck,62,,,62108000BH0007,,,4,,,,,,,,,,1,1,Maison,79,4,,,,,,1.571867,50.403882
2021-1055512,2021-01-22,000001,Vente,3500,24,,RUE DE L ABBE VANDEWALLE,0010,62600,62108,Berck,62,,,62108000BE0039,,,,,,,,,,,,,0,,,,,J,jardins,POTAG,Jardin potager,159,1.584712,50.405002
2021-1055517,2021-01-19,000001,Vente,170000,1,,RUE DE LA PLAGE,1435,62600,62108,Berck,62,,,62108000CL0017,,,9,,,,,,,,,,1,2,Appartement,65,3,,,,,,1.561015,50.408059
2021-1055527,2021-02-06,000001,Vente,126000,97,,AV ST EXUPERY,1608,62600,62108,Berck,62,,,62108000BN0151,,,88,,,,,,,,,,1,2,Appartement,60,3,,,,,,1.567467,50.399613
2021-1055527,2021-02-06,000001,Vente,126000,97,,AV ST EXUPERY,1608,62600,62108,Berck,62,,,62108000BN0151,,,118,,,,,,,,,,1,3,Dépendance,,0,,,,,,1.567467,50.399613
2021-1055530,2021-01-28,000001,Vente,70000,3,,AV DU HUIT MAI 1945,0855,62600,62108,Berck,62,,,62108000BH0060,,,65,,,,,,,,,,1,2,Appartement,47,2,,,,,,1.579511,50.404029
2021-1055530,2021-01-28,000001,Vente,70000,3,,AV DU HUIT MAI 1945,0855,62600,62108,Berck,62,,,62108000BH0060,,,283,,,,,,,,,,1,3,Dépendance,,0,,,,,,1.579511,50.404029
2021-1055534,2021-01-15,000002,Vente,145000,17,,RUE EUGENE TRIGOULET,0610,62600,62108,Berck,62,,,62108000BR0432,,,,,,,,,,,,,0,,,,,S,sols,,,51,1.562557,50.402371
2021-1055535,2021-01-16,000001,Vente en l'état futur d'achèvement,152000,79,,BD DE LA MANCHE,1000,62600,62108,Berck,62,,,62108000AN0040,,,94,,,,,,,,,,1,3,Dépendance,,0,,,,,,1.568304,50.418719
2021-1055535,2021-01-16,000001,Vente en l'état futur d'achèvement,152000,79,,BD DE LA MANCHE,1000,62600,62108,Berck,62,,,62108000AN0040,,,52,,,,,,,,,,1,3,Dépendance,,0,,,,,,1.568304,50.418719
2021-1055535,2021-01-16,000001,Vente en l'état futur d'achèvement,152000,79,,BD DE LA MANCHE,1000,62600,62108,Berck,62,,,62108000AN0040,,,34,,,,,,,,,,1,2,Appartement,42,2,,,,,,1.568304,50.418719
2021-1055540,2021-01-23,000001,Vente,125000,58,,RUE DU DOC CALVE,0478,62600,62108,Berck,62,,,62108000BS0009,,,60,,66,,72,,,,,,3,2,Appartement,73,3,,,,,,1.566838,50.400911
2021-1055541,2021-01-25,000001,Vente,145000,147,,BD DE BOULOGNE,0280,62600,62108,Berck,62,,,62108000AH0142,,,25,54.69,,,,,,,,,1,1,Maison,66,3,,,,,,1.589411,50.415015
2021-1055541,2021-01-25,000001,Vente,145000,147,,BD DE BOULOGNE,0280,62600,62108,Berck,62,,,62108000AH0142,,,42,,,,,,,,,,1,3,Dépendance,,0,,,,,,1.589411,50.415015
2021-1055543,2021-01-28,000001,Vente,169000,50,,RES FLEUR DE DUNE,A704,62600,62108,Berck,62,,,62108000CD0062,,,129,,,,,,,,,,1,3,Dépendance,,0,,,,,,1.570752,50.410591
2021-1055543,2021-01-28,000001,Vente,169000,50,,RES FLEUR DE DUNE,A704,62600,62108,Berck,62,,,62108000CD0062,,,76,,,,,,,,,,1,3,Dépendance,,0,,,,,,1.570752,50.410591
2021-1055543,2021-01-28,000001,Vente,169000,50,,RES FLEUR DE DUNE,A704,62600,62108,Berck,62,,,62108000CD0062,,,40,49.37,,,,,,,,,1,2,Appartement,47,2,,,,,,1.570752,50.410591
2021-1055545,2021-01-28,000001,Vente,119600,9,,RUE DU FOIER,0653,62600,62108,Berck,62,,,62108000AR0001,,,29,,,,,,,,,,1,2,Appartement,52,3,,,,,,1.583823,50.41098
2021-1055545,2021-01-28,000001,Vente,119600,9,,RUE DU FOIER,0653,62600,62108,Berck,62,,,62108000AR0001,,,91,,,,,,,,,,1,3,Dépendance,,0,,,,,,1.583823,50.41098
2021-1055546,2021-01-29,000001,Vente,103000,493,,RUE DE L IMPERATRICE,0860,62600,62108,Berck,62,,,62108000AV0059,,,,,,,,,,,,,0,,,,,S,sols,,,422,,
2021-1055546,2021-01-29,000001,Vente,103000,491,,RUE DE L IMPERATRICE,0860,62600,62108,Berck,62,,,62108000AV0060,,,,,,,,,,,,,0,,,,,S,sols,,,208,,
2021-1055546,2021-01-29,000001,Vente,103000,491,,RUE DE L IMPERATRICE,0860,62600,62108,Berck,62,,,62108000AV0061,,,,,,,,,,,,,0,,,,,S,sols,,,214,,
2021-1055547,2021-01-29,000001,Vente,277000,16,,RUE DES BONNES GENS,0260,62600,62108,Berck,62,,,62108000AW0013,,,,,,,,,,,,,0,1,Maison,94,4,J,jardins,POTAG,Jardin potager,632,1.594574,50.406538
2021-1055547,2021-01-29,000001,Vente,277000,16,,RUE DES BONNES GENS,0260,62600,62108,Berck,62,,,62108000AW0013,,,,,,,,,,,,,0,1,Maison,94,4,S,sols,,,453,1.594574,50.406538
2021-1055548,2021-01-30,000001,Vente,68000,111,,RUE DE L IMPERATRICE,0860,62600,62108,Berck,62,,,62108000CH0240,,,6,,,,,,,,,,1,4,Local industriel. commercial ou assimilé,3,0,,,,,,1.572019,50.405979
2021-1055548,2021-01-30,000001,Vente,68000,111,,RUE DE L IMPERATRICE,0860,62600,62108,Berck,62,,,62108000CH0240,,,2,,,,,,,,,,1,4,Local industriel. commercial ou assimilé,40,0,,,,,,1.572019,50.405979
2021-1055556,2021-01-28,000001,Vente,130000,351,,RUE DE L IMPERATRICE,0860,62600,62108,Berck,62,,,62108000BY0108,,,,,,,,,,,,,0,4,Local industriel. commercial ou assimilé,156,0,S,sols,,,300,1.585348,50.408172
2021-1055556,2021-01-28,000001,Vente,130000,351,,RUE DE L IMPERATRICE,0860,62600,62108,Berck,62,,,62108000BY0108,,,,,,,,,,,,,0,4,Local industriel. commercial ou assimilé,151,0,S,sols,,,300,1.585348,50.408172
2021-1055569,2021-02-10,000001,Vente,223200,16,,RES LES TERRASSES DE L'AUTHIE,A770,62600,62108,Berck,62,,,62108000BK0461,,,2,,,,,,,,,,1,2,Appartement,66,4,,,,,,1.573294,50.399017
2021-1055569,2021-02-10,000001,Vente,223200,16,,RES LES TERRASSES DE L'AUTHIE,A770,62600,62108,Berck,62,,,62108000BK0461,,,6,,,,,,,,,,1,3,Dépendance,,0,,,,,,1.573294,50.399017
2021-1055581,2021-01-28,000001,Vente,205000,,,RUE DE L ANCIEN CALVAIRE,0080,62600,62108,Berck,62,,,62108000BR0426,,,,,,,,,,,,,0,,,,,S,sols,,,4,1.563068,50.404297
2021-1055581,2021-01-28,000001,Vente,205000,5,,RUE DOCTEUR VICTOR MENARD,0520,62600,62108,Berck,62,,,62108000BR0427,,,,,,,,,,,,,0,1,Maison,65,3,S,sols,,,210,1.56299,50.404307
2021-1055581,2021-01-28,000001,Vente,205000,5,,RUE DOCTEUR VICTOR MENARD,0520,62600,62108,Berck,62,,,62108000BR0427,,,,,,,,,,,,,0,4,Local industriel. commercial ou assimilé,407,0,S,sols,,,210,1.56299,50.404307
2021-1055585,2021-01-25,000001,Vente,85200,32,,RUE LEONIE DUPLAIX,0940,62600,62108,Berck,62,,,62108000BT0424,,,4,,,,,,,,,,1,2,Appartement,33,1,,,,,,1.567376,50.40327
2021-1055585,2021-01-25,000001,Vente,85200,32,,RUE LEONIE DUPLAIX,0940,62600,62108,Berck,62,,,62108000BT0424,,,7,,,,,,,,,,1,3,Dépendance,,0,,,,,,1.567376,50.40327
2021-1055592,2021-02-03,000001,Vente,110000,7,,RUE SIMON DUBOIS,1720,62600,62108,Berck,62,,,62108000CK0103,,,4,,,,,,,,,,1,2,Appartement,49,2,,,,,,1.561821,50.405872
2021-1055592,2021-02-03,000001,Vente,110000,7,,RUE SIMON DUBOIS,1720,62600,62108,Berck,62,,,62108000CK0103,,,2,,,,,,,,,,1,3,Dépendance,,0,,,,,,1.561821,50.405872
2021-1055601,2021-02-01,000001,Vente,155000,36,,CHE AUX RAISINS,1510,62600,62108,Berck,62,,,62108000BK0498,,,,,,,,,,,,,0,1,Maison,77,3,S,sols,,,305,1.569871,50.399051
2021-1055614,2021-02-10,000001,Vente,105000,30,,BD DE PARIS,1310,62600,62108,Berck,62,,,62108000BS0170,,,,,,,,,,,,,0,4,Local industriel. commercial ou assimilé,175,0,S,sols,,,174,1.569532,50.402882
2021-1055626,2021-01-19,000001,Vente,77000,3,,RUE DES PATRES,1340,62600,62108,Berck,62,,,62108000BD0059,,,,,,,,,,,,,0,1,Maison,44,2,S,sols,,,80,1.59055,50.407505
2021-1055629,2021-01-23,000001,Vente,18000,36,,ESP PARMENTIER,1320,62600,62108,Berck,62,,,62108000CL0423,,,36,,,,,,,,,,1,3,Dépendance,,0,,,,,,1.561756,50.409518
2021-1055650,2021-02-17,000001,Vente,230000,12,,RUE DE LA MER,1050,62600,62108,Berck,62,,,62108000CK0053,,,,,,,,,,,,,0,1,Maison,126,3,S,sols,,,101,1.561016,50.406871
2021-1055656,2021-02-17,000001,Vente,120000,92,,AV MICHEL MALINGRE,1080,62600,62108,Berck,62,,,62108000CD0589,,,,,,,,,,,,,0,,,,,S,sols,,,126,1.575566,50.409424
2021-1055664,2021-01-28,000001,Vente,375000,20,,RUE MARIUS CHAMBON,1035,62600,62108,Berck,62,,,62108000BR0253,,,,,,,,,,,,,0,1,Maison,160,6,S,sols,,,505,1.564143,50.401826
2021-1055666,2021-02-12,000001,Vente,230000,72,,AV MICHEL MALINGRE,1080,62600,62108,Berck,62,,,62108000CD0201,,,,,,,,,,,,,0,1,Maison,58,3,S,sols,,,587,1.57389,50.409341
2021-1055667,2021-02-04,000001,Vente,177000,188,,BD DE PARIS,1310,62600,62108,Berck,62,,,62108000AY0060,,,,,,,,,,,,,0,1,Maison,73,4,S,sols,,,330,1.589702,50.402961
2021-1055671,2021-02-20,000001,Vente,125000,23,,RES ST EXUPERY,A724,62600,62108,Berck,62,,,62108000BR0389,,,77,,,,,,,,,,1,3,Dépendance,,0,,,,,,1.561488,50.401707
2021-1055671,2021-02-20,000001,Vente,125000,23,,RES ST EXUPERY,A724,62600,62108,Berck,62,,,62108000BR0389,,,23,,,,,,,,,,1,2,Appartement,51,2,,,,,,1.561488,50.401707
2021-1055687,2021-02-18,000001,Vente,220000,60,,RUE CARNOT,0330,62600,62108,Berck,62,,,62108000CI0324,,,1,,2,,6,,7,,8,,6,4,Local industriel. commercial ou assimilé,188,0,,,,,,1.564762,50.406677
2021-1055724,2021-02-02,000001,Vente,190000,51,,BD DE BOULOGNE,0280,62600,62108,Berck,62,,,62108000AO0021,,,,,,,,,,,,,0,1,Maison,45,2,S,sols,,,300,1.572579,50.41456
2021-1055724,2021-02-02,000001,Vente,190000,51,,BD DE BOULOGNE,0280,62600,62108,Berck,62,,,62108000AO0021,,,,,,,,,,,,,0,1,Maison,61,3,S,sols,,,300,1.572579,50.41456
2021-1055726,2021-02-19,000001,Vente,150960,58,,RUE DU DOC CALVE,0478,62600,62108,Berck,62,,,62108000BS0009,,,59,,65,,71,,,,,,3,2,Appartement,73,3,,,,,,1.566838,50.400911
2021-1055734,2021-02-09,000001,Vente,10945,,,LA MOLLIERE,B020,62600,62108,Berck,62,,,62108000AY0424,,,,,,,,,,,,,0,,,,,J,jardins,,,155,1.59582,50.401976
2021-1055734,2021-02-09,000001,Vente,10945,27,B,RPT DE PICARDIE,1398,62600,62108,Berck,62,,,62108000AY0425,,,,,,,,,,,,,0,1,Maison,108,4,J,jardins,,,194,1.596216,50.402137
2021-1055734,2021-02-09,000001,Vente,10945,,,BD DE PARIS,1310,62600,62108,Berck,62,,,62108000AY0433,,,,,,,,,,,,,0,,,,,S,sols,,,220,1.595561,50.402341
2021-1055738,2021-02-09,000001,Vente,220000,8,,RUE DU ONZE NOVEMBRE,1240,62600,62108,Berck,62,,,62108000BT0255,,,,,,,,,,,,,0,1,Maison,83,6,S,sols,,,86,1.566089,50.404184
2021-1055747,2021-02-10,000001,Vente en l'état futur d'achèvement,154368,79,,BD DE LA MANCHE,1000,62600,62108,Berck,62,,,62108000AN0040,,,75,,,,,,,,,,1,3,Dépendance,,0,,,,,,1.568304,50.418719
2021-1055747,2021-02-10,000001,Vente en l'état futur d'achèvement,154368,79,,BD DE LA MANCHE,1000,62600,62108,Berck,62,,,62108000AN0040,,,23,,,,,,,,,,1,2,Appartement,47,3,,,,,,1.568304,50.418719
2021-1055747,2021-02-10,000001,Vente en l'état futur d'achèvement,154368,79,,BD DE LA MANCHE,1000,62600,62108,Berck,62,,,62108000AN0040,,,48,,,,,,,,,,1,3,Dépendance,,0,,,,,,1.568304,50.418719
2021-1055751,2021-02-10,000001,Vente,18000,62,,RUE CARNOT,0330,62600,62108,Berck,62,,,62108000CI0286,,,6,,,,,,,,,,1,3,Dépendance,,0,,,,,,1.564977,50.406709
2021-1055756,2021-02-04,000001,Vente,630000,1,,RES VILLA OPALE / GRAND HOTEL,A782,62600,62108,Berck,62,,,62108000CN0557,,,222,,223,,,,,,,,2,4,Local industriel. commercial ou assimilé,232,0,,,,,,1.563468,50.41322
2021-1055772,2021-02-26,000001,Vente,123000,22,,RUE DU SILENCE,1710,62600,62108,Berck,62,,,62108000BZ0125,,,,,,,,,,,,,0,1,Maison,79,4,S,sols,,,92,1.581465,50.408051
2021-1055773,2021-03-02,000001,Vente,265000,525,,RUE DE L IMPERATRICE,0860,62600,62108,Berck,62,,,62108000AV0020,,,,,,,,,,,,,0,1,Maison,80,4,S,sols,,,503,1.598081,50.409447
2021-1055786,2021-02-12,000001,Vente,120300,,,RUE DE L USINE,1880,62600,62108,Berck,62,,,62108000BV0106,,,,,,,,,,,,,0,,,,,S,sols,,,19,1.574429,50.405871
2021-1055786,2021-02-12,000001,Vente,120300,166,,RUE DE L IMPERATRICE,0860,62600,62108,Berck,62,,,62108000BV0107,,,,,,,,,,,,,0,1,Maison,50,2,S,sols,,,143,1.574401,50.405998
2021-1055790,2021-03-05,000001,Vente,132200,29,,RUE DE CONSTANTINE,0410,62600,62108,Berck,62,,,62108000CH0017,,,12,,,,,,,,,,1,2,Appartement,51,3,,,,,,1.568729,50.406587
2021-1055798,2021-02-19,000001,Vente,93000,29,,RUE SAINT GEORGES,1620,62600,62108,Berck,62,,,62108000CL0296,,,22,,,,,,,,,,1,2,Appartement,36,2,,,,,,1.56291,50.407051
2021-1055805,2021-02-19,000001,Vente,153000,12,,RES LES GLYCINES  25 CHE GENTY,A750,62600,62108,Berck,62,,,62108000AO0359,,,,,,,,,,,,,0,1,Maison,57,3,S,sols,,,83,1.574623,50.416349
2021-1055812,2021-02-26,000001,Vente,197630,7,,RUE ARTHUR BECQUART,0150,62600,62108,Berck,62,,,62108000BR0402,,,101,,104,,,,,,,,2,2,Appartement,88,3,,,,,,1.563139,50.40383
2021-1055815,2021-02-12,000001,Vente,223000,11,,ALL DES ALOUETTES,0054,62600,62108,Berck,62,,,62108000AM0235,,,,,,,,,,,,,0,1,Maison,99,6,S,sols,,,360,1.570328,50.420478
2021-1055817,2021-02-18,000001,Vente,290000,37,,BD DE PARIS,1310,62600,62108,Berck,62,,,62108000BH0007,,,7,,,,,,,,,,1,1,Maison,85,4,,,,,,1.571867,50.403882
2021-1055819,2021-02-23,000001,Vente,150000,19,,RUE SOUBITEZ,1740,62600,62108,Berck,62,,,62108000CD0473,,,1,,2,,,,,,,,2,2,Appartement,69,3,,,,,,1.570523,50.407516
2021-1055819,2021-02-23,000001,Vente,150000,19,,RUE SOUBITEZ,1740,62600,62108,Berck,62,,,62108000CD0473,,,4,,,,,,,,,,1,3,Dépendance,,0,,,,,,1.570523,50.407516
2021-1055819,2021-02-23,000001,Vente,150000,19,,RUE SOUBITEZ,1740,62600,62108,Berck,62,,,62108000CD0473,,,3,,,,,,,,,,1,3,Dépendance,,0,,,,,,1.570523,50.407516
2021-1055830,2021-02-26,000001,Vente,127000,58,,RUE DES FRERES MOZER,0685,62600,62108,Berck,62,,,62108000BN0151,,,212,,,,,,,,,,1,3,Dépendance,,0,,,,,,1.567467,50.399613
2021-1055830,2021-02-26,000001,Vente,127000,97,,AV ST EXUPERY,1608,62600,62108,Berck,62,,,62108000BN0151,,,96,,,,,,,,,,1,2,Appartement,46,2,,,,,,1.567467,50.399613
2021-1055830,2021-02-26,000001,Vente,127000,97,,AV ST EXUPERY,1608,62600,62108,Berck,62,,,62108000BN0151,,,109,,,,,,,,,,1,3,Dépendance,,0,,,,,,1.567467,50.399613
2021-1055847,2021-03-08,000001,Vente,89719,9,,RUE DU FOIER,0653,62600,62108,Berck,62,,,62108000AR0001,,,56,,,,,,,,,,1,2,Appartement,42,2,,,,,,1.583823,50.41098
2021-1055847,2021-03-08,000001,Vente,89719,9,,RUE DU FOIER,0653,62600,62108,Berck,62,,,62108000AR0001,,,128,,,,,,,,,,1,3,Dépendance,,0,,,,,,1.583823,50.41098
2021-1055849,2021-02-26,000001,Vente,103200,7,,RUE DU MARECHAL JUIN,1015,62600,62108,Berck,62,,,62108000BP0083,,,4,,,,,,,,,,1,2,Appartement,45,3,,,,,,1.561357,50.403894
2021-1055853,2021-02-23,000001,Vente,570000,52,,RUE DE LHOMEL,0950,62600,62108,Berck,62,,,62108000BR0251,,,,,,,,,,,,,0,1,Maison,276,9,S,sols,,,666,1.564021,50.401373
2021-1055854,2021-02-20,000001,Vente,113750,102,,RUE ROTHSCHILD,1560,62600,62108,Berck,62,,,62108000CM0122,,,6,,,,,,,,,,1,3,Dépendance,,0,,,,,,1.565424,50.40999
2021-1055854,2021-02-20,000001,Vente,113750,102,,RUE ROTHSCHILD,1560,62600,62108,Berck,62,,,62108000CM0122,,,4,,,,,,,,,,1,2,Appartement,56,3,,,,,,1.565424,50.40999
2021-1055871,2021-02-18,000001,Vente,237500,43,,RUE DU ONZE NOVEMBRE,1240,62600,62108,Berck,62,,,62108000BT0202,,,4,,,,,,,,,,1,2,Appartement,40,3,,,,,,1.566901,50.403115
2021-1055871,2021-02-18,000001,Vente,237500,43,,RUE DU ONZE NOVEMBRE,1240,62600,62108,Berck,62,,,62108000BT0202,,,6,,,,,,,,,,1,2,Appartement,40,3,,,,,,1.566901,50.403115
2021-1055871,2021-02-18,000001,Vente,237500,43,,RUE DU ONZE NOVEMBRE,1240,62600,62108,Berck,62,,,62108000BT0202,,,1,,,,,,,,,,1,2,Appartement,40,3,,,,,,1.566901,50.403115
2021-1055871,2021-02-18,000001,Vente,237500,43,,RUE DU ONZE NOVEMBRE,1240,62600,62108,Berck,62,,,62108000BT0202,,,2,,,,,,,,,,1,2,Appartement,40,3,,,,,,1.566901,50.403115