id_mutation,date_mutation,numero_disposition,nature_mutation,valeur_fonciere,adresse_numero,adresse_suffixe,adresse_nom_voie,adresse_code_voie,code_postal,code_commune,nom_commune,code_departement,ancien_code_commune,ancien_nom_commune,id_parcelle,ancien_id_parcelle,numero_volume,lot1_numero,lot1_surface_carrez,lot2_numero,lot2_surface_carrez,lot3_numero,lot3_surface_carrez,lot4_numero,lot4_surface_carrez,lot5_numero,lot5_surface_carrez,nombre_lots,code_type_local,type_local,surface_reelle_bati,nombre_pieces_principales,code_nature_culture,nature_culture,code_nature_culture_speciale,nature_culture_speciale,surface_terrain,longitude,latitude
2021-1055717,2021-02-22,000001,Vente,32000,7,,RUE BLANCHE,0005,62990,62157,Boubers-lès-Hesmond,62,,,621570000A0300,,,,,,,,,,,,,0,1,Maison,49,2,P,prés,,,893,1.947652,50.475614
2021-1056516,2021-04-23,000001,Vente,100000,2,,RUE DE LA MAIRIE,0030,62990,62157,Boubers-lès-Hesmond,62,,,621570000A0150,,,,,,,,,,,,,0,1,Maison,250,8,S,sols,,,1490,1.949384,50.475423
2021-1056516,2021-04-23,000001,Vente,100000,,,LE VILLAGE,B006,62990,62157,Boubers-lès-Hesmond,62,,,621570000A0286,,,,,,,,,,,,,0,,,,,S,sols,,,109,1.949181,50.475376
2021-1056516,2021-04-23,000001,Vente,100000,,,LE VILLAGE,B006,62990,62157,Boubers-lès-Hesmond,62,,,621570000A0286,,,,,,,,,,,,,0,,,,,J,jardins,,,569,1.949181,50.475376
2021-1056516,2021-04-23,000001,Vente,100000,,,LE VILLAGE,B006,62990,62157,Boubers-lès-Hesmond,62,,,621570000A0351,,,,,,,,,,,,,0,,,,,P,prés,,,17,1.9486,50.475548
2021-1056516,2021-04-23,000001,Vente,100000,,,LE VILLAGE,B006,62990,62157,Boubers-lès-Hesmond,62,,,621570000A0353,,,,,,,,,,,,,0,,,,,S,sols,,,887,1.949191,50.475565
2021-1056842,2021-05-21,000001,Vente,5500,,,L ESPERANCE,B001,62990,62157,Boubers-lès-Hesmond,62,,,621570000A0074,,,,,,,,,,,,,0,,,,,BT,taillis simples,,,3335,1.954347,50.479745
2021-1057624,2021-07-30,000001,Vente,16829,,,LA LIBERTE,B003,62990,62157,Boubers-lès-Hesmond,62,,,62157000ZA0015,,,,,,,,,,,,,0,,,,,T,terres,,,8760,1.938345,50.484386
2021-1057659,2021-07-27,000001,Vente,122000,2,,RUE BLANCHE,0005,62990,62157,Boubers-lès-Hesmond,62,,,621570000A0285,,,,,,,,,,,,,0,1,Maison,80,3,S,sols,,,762,1.94875,50.475364
2021-1058258,2021-10-08,000001,Vente,40000,39,,RTE DE FRUGES,0024,62990,62157,Boubers-lès-Hesmond,62,,,62157000ZB0059,,,,,,,,,,,,,0,1,Maison,54,3,S,sols,,,1000,1.951331,50.481099
2021-1058258,2021-10-08,000001,Vente,40000,39,,RTE DE FRUGES,0024,62990,62157,Boubers-lès-Hesmond,62,,,62157000ZB0059,,,,,,,,,,,,,0,1,Maison,54,3,J,jardins,,,553,1.951331,50.481099
2021-1058676,2021-11-08,000001,Vente,145000,7,,IMP DE LA TOURTERELLE,0060,62990,62157,Boubers-lès-Hesmond,62,,,62157000ZB0061,,,,,,,,,,,,,0,3,Dépendance,,0,S,sols,,,1000,1.949147,50.481541
2021-1058676,2021-11-08,000001,Vente,145000,7,,IMP DE LA TOURTERELLE,0060,62990,62157,Boubers-lès-Hesmond,62,,,62157000ZB0061,,,,,,,,,,,,,0,3,Dépendance,,0,J,jardins,,,1597,1.949147,50.481541
2021-1058676,2021-11-08,000001,Vente,145000,7,,IMP DE LA TOURTERELLE,0060,62990,62157,Boubers-lès-Hesmond,62,,,62157000ZB0061,,,,,,,,,,,,,0,1,Maison,80,3,S,sols,,,1000,1.949147,50.481541
2021-1058676,2021-11-08,000001,Vente,145000,7,,IMP DE LA TOURTERELLE,0060,62990,62157,Boubers-lès-Hesmond,62,,,62157000ZB0061,,,,,,,,,,,,,0,1,Maison,80,3,J,jardins,,,1597,1.949147,50.481541
