id_mutation,date_mutation,numero_disposition,nature_mutation,valeur_fonciere,adresse_numero,adresse_suffixe,adresse_nom_voie,adresse_code_voie,code_postal,code_commune,nom_commune,code_departement,ancien_code_commune,ancien_nom_commune,id_parcelle,ancien_id_parcelle,numero_volume,lot1_numero,lot1_surface_carrez,lot2_numero,lot2_surface_carrez,lot3_numero,lot3_surface_carrez,lot4_numero,lot4_surface_carrez,lot5_numero,lot5_surface_carrez,nombre_lots,code_type_local,type_local,surface_reelle_bati,nombre_pieces_principales,code_nature_culture,nature_culture,code_nature_culture_speciale,nature_culture_speciale,surface_terrain,longitude,latitude
2021-1039302,2021-01-11,000001,Vente,45000,56,,RUE DU VERMETZ,0750,62220,62215,Carvin,62,,,62215000AI0056,,,,,,,,,,,,,0,1,Maison,54,2,S,sols,,,231,2.944141,50.482929
2021-1039305,2021-01-05,000001,Vente,154000,12,,RUE DES MILLIONNAIRES,0479,62220,62215,Carvin,62,,,62215000AW0039,,,,,,,,,,,,,0,1,Maison,90,4,S,sols,,,426,2.967925,50.492614
2021-1039329,2021-01-11,000001,Vente,126000,117,,RUE JEAN MOULIN,0361,62220,62215,Carvin,62,,,62215000AC0827,,,,,,,,,,,,,0,1,Maison,100,4,S,sols,,,183,2.964905,50.492374
2021-1039333,2021-01-13,000001,Vente,59140,,,LES ECUSSONS NORD,B015,62220,62215,Carvin,62,,,62215000ZK0459,,,,,,,,,,,,,0,,,,,AB,terrains a bâtir,,,401,2.97614,50.498703
2021-1039335,2021-01-12,000001,Vente,118000,111,,RUE FRANCIS DE PRESSENSE,0270,62220,62215,Carvin,62,,,62215000AD0487,,,,,,,,,,,,,0,1,Maison,114,4,S,sols,,,253,,
2021-1039374,2021-01-15,000001,Vente,140000,112,,RUE ROBESPIERRE,0617,62220,62215,Carvin,62,,,62215000AB0545,,,,,,,,,,,,,0,1,Maison,89,5,S,sols,,,400,2.967268,50.49535
2021-1039387,2021-01-18,000001,Vente,272100,,,EPINOY,B018,62220,62215,Carvin,62,,,62215000AK0568,,,,,,,,,,,,,0,,,,,AB,terrains a bâtir,,,41,2.944414,50.486379
2021-1039387,2021-01-18,000001,Vente,272100,11,,RUE JB DE LA QUINTINIE,0369,62220,62215,Carvin,62,,,62215000AK0570,,,,,,,,,,,,,0,1,Maison,93,4,S,sols,,,379,2.944387,50.486283
2021-1039387,2021-01-18,000001,Vente,272100,,,EPINOY,B018,62220,62215,Carvin,62,,,62215000AK0642,,,,,,,,,,,,,0,,,,,AB,terrains a bâtir,,,20,2.944394,50.486345
2021-1039424,2021-01-04,000001,Vente,354000,187,,RUE DU MARECHAL FOCH,0450,62220,62215,Carvin,62,,,62215000ZK0118,,,,,,,,,,,,,0,1,Maison,150,8,S,sols,,,997,2.964395,50.501778
2021-1039437,2021-01-15,000001,Vente,193000,26,,RUE PASTEUR,0530,62220,62215,Carvin,62,,,62215000AD0307,,,,,,,,,,,,,0,1,Maison,220,5,AG,terrains d'agrément,,,268,2.956458,50.488305
2021-1039437,2021-01-15,000001,Vente,193000,26,,RUE PASTEUR,0530,62220,62215,Carvin,62,,,62215000AD0307,,,,,,,,,,,,,0,1,Maison,220,5,S,sols,,,1000,2.956458,50.488305
2021-1039447,2021-01-15,000001,Vente,352000,121,,RUE FRANCIS DE PRESSENSE,0270,62220,62215,Carvin,62,,,62215000AD0465,,,,,,,,,,,,,0,3,Dépendance,,0,S,sols,,,17,2.954678,50.488451
2021-1039447,2021-01-15,000001,Vente,352000,142,,RUE FRANCIS DE PRESSENSE,0270,62220,62215,Carvin,62,,,62215000AL0072,,,,,,,,,,,,,0,1,Maison,156,5,J,jardins,,,1151,2.953133,50.488635
2021-1039447,2021-01-15,000001,Vente,352000,142,,RUE FRANCIS DE PRESSENSE,0270,62220,62215,Carvin,62,,,62215000AL0072,,,,,,,,,,,,,0,3,Dépendance,,0,J,jardins,,,1151,2.953133,50.488635
2021-1039447,2021-01-15,000001,Vente,352000,142,,RUE FRANCIS DE PRESSENSE,0270,62220,62215,Carvin,62,,,62215000AL0072,,,,,,,,,,,,,0,4,Local industriel. commercial ou assimilé,68,0,S,sols,,,294,2.953133,50.488635
2021-1039447,2021-01-15,000001,Vente,352000,142,,RUE FRANCIS DE PRESSENSE,0270,62220,62215,Carvin,62,,,62215000AL0072,,,,,,,,,,,,,0,1,Maison,156,5,S,sols,,,294,2.953133,50.488635
2021-1039447,2021-01-15,000001,Vente,352000,142,,RUE FRANCIS DE PRESSENSE,0270,62220,62215,Carvin,62,,,62215000AL0072,,,,,,,,,,,,,0,3,Dépendance,,0,S,sols,,,294,2.953133,50.488635
2021-1039447,2021-01-15,000001,Vente,352000,142,,RUE FRANCIS DE PRESSENSE,0270,62220,62215,Carvin,62,,,62215000AL0072,,,,,,,,,,,,,0,4,Local industriel. commercial ou assimilé,68,0,J,jardins,,,1151,2.953133,50.488635
2021-1039448,2021-01-15,000001,Vente,224500,7,,RUE DES CAPUCINES,0071,62220,62215,Carvin,62,,,62215000AB0861,,,,,,,,,,,,,0,1,Maison,103,6,S,sols,,,381,2.965648,50.496812
2021-1039557,2021-01-15,000001,Vente,170000,137,,RUE FRANCIS DE PRESSENSE,0270,62220,62215,Carvin,62,,,62215000AD0407,,,,,,,,,,,,,0,4,Local industriel. commercial ou assimilé,114,0,J,jardins,,,476,2.953854,50.487611
2021-1039557,2021-01-15,000001,Vente,170000,137,,RUE FRANCIS DE PRESSENSE,0270,62220,62215,Carvin,62,,,62215000AD0407,,,,,,,,,,,,,0,1,Maison,81,3,S,sols,,,266,2.953854,50.487611
2021-1039557,2021-01-15,000001,Vente,170000,137,,RUE FRANCIS DE PRESSENSE,0270,62220,62215,Carvin,62,,,62215000AD0407,,,,,,,,,,,,,0,4,Local industriel. commercial ou assimilé,114,0,S,sols,,,266,2.953854,50.487611
2021-1039557,2021-01-15,000001,Vente,170000,137,,RUE FRANCIS DE PRESSENSE,0270,62220,62215,Carvin,62,,,62215000AD0407,,,,,,,,,,,,,0,1,Maison,81,3,J,jardins,,,476,2.953854,50.487611
2021-1039574,2021-01-26,000002,Vente,1000,2,,RUE DES PAPILLONS,0520,62220,62215,Carvin,62,,,62215000AE0801,,,,,,,,,,,,,0,,,,,S,sols,,,101,2.958835,50.485525
2021-1039575,2021-01-25,000001,Vente,175572,11,,RUE DE LA GARE PROLONGEE,0351,62220,62215,Carvin,62,,,62215000AM0155,,,,,,,,,,,,,0,3,Dépendance,,0,S,sols,,,643,2.94876,50.493425
2021-1039575,2021-01-25,000001,Vente,175572,11,,RUE DE LA GARE PROLONGEE,0351,62220,62215,Carvin,62,,,62215000AM0155,,,,,,,,,,,,,0,3,Dépendance,,0,S,sols,,,643,2.94876,50.493425
2021-1039575,2021-01-25,000001,Vente,175572,11,,RUE DE LA GARE PROLONGEE,0351,62220,62215,Carvin,62,,,62215000AM0155,,,,,,,,,,,,,0,1,Maison,73,3,S,sols,,,643,2.94876,50.493425
2021-1039620,2021-01-27,000001,Vente,170000,2,B,IMP EVRARD,0233,62220,62215,Carvin,62,,,62215000AH0904,,,,,,,,,,,,,0,,,,,S,sols,,,12,2.94902,50.485869
2021-1039620,2021-01-27,000001,Vente,170000,2,B,IMP EVRARD,0233,62220,62215,Carvin,62,,,62215000AH0905,,,,,,,,,,,,,0,1,Maison,89,4,S,sols,,,160,2.948854,50.485836
2021-1039626,2021-01-20,000001,Vente,1300,71,,RUE SALVADOR ALLENDE,0659,62220,62215,Carvin,62,,,62215000AO0462,,,14,,,,,,,,,,1,3,Dépendance,,0,,,,,,2.958803,50.496472
2021-1039644,2021-01-28,000001,Vente,196000,25,,RUE DES HERONS,0346,62220,62215,Carvin,62,,,62215000ZL0691,,,,,,,,,,,,,0,1,Maison,70,5,S,sols,,,327,2.966674,50.487292
2021-1039644,2021-01-28,000001,Vente,196000,,,LE WILLERVAL,B058,62220,62215,Carvin,62,,,62215000ZL0716,,,,,,,,,,,,,0,,,,,AB,terrains a bâtir,,,12,2.966797,50.487299
2021-1039651,2021-01-27,000001,Vente,30000,135,,CHE DE LA FRETE,0290,62220,62215,Carvin,62,,,62215000AK0699,,,,,,,,,,,,,0,3,Dépendance,,0,S,sols,,,271,2.939318,50.486059
2021-1039651,2021-01-27,000001,Vente,30000,135,,CHE DE LA FRETE,0290,62220,62215,Carvin,62,,,62215000AK0699,,,,,,,,,,,,,0,1,Maison,59,3,S,sols,,,271,2.939318,50.486059
2021-1039655,2021-01-27,000001,Vente,80500,18,,RUE SAINTE CATHERINE,0640,62220,62215,Carvin,62,,,62215000AH0902,,,,,,,,,,,,,0,1,Maison,115,5,S,sols,,,449,2.94938,50.485288
2021-1039710,2021-01-29,000001,Vente,11396,,,HAUT DE CARNIN,B060,62220,62215,Carvin,62,,,62215000ZI0064,,,,,,,,,,,,,0,,,,,T,terres,,,15632,2.954107,50.50708
2021-1039710,2021-01-29,000001,Vente,11396,,,LE MARAIS DE CARVIN,B035,62220,62215,Carvin,62,,,62215000ZL0075,,,,,,,,,,,,,0,,,,,T,terres,,,1007,2.968285,50.484055
2021-1039710,2021-01-29,000001,Vente,11396,,,LE MARAIS DE CARVIN,B035,62220,62215,Carvin,62,,,62215000ZL0077,,,,,,,,,,,,,0,,,,,T,terres,,,8070,2.967183,50.483861
2021-1039803,2021-01-22,000001,Vente,60000,5001,F,RUE DU TERRIL,0687,62220,62215,Carvin,62,,,62215000AV0327,,,,,,,,,,,,,0,3,Dépendance,,0,S,sols,,,480,2.976689,50.489857
2021-1039803,2021-01-22,000001,Vente,60000,5001,F,RUE DU TERRIL,0687,62220,62215,Carvin,62,,,62215000AV0327,,,,,,,,,,,,,0,3,Dépendance,,0,S,sols,,,480,2.976689,50.489857
2021-1039803,2021-01-22,000001,Vente,60000,6,,RUE DU TERRIL,0687,62220,62215,Carvin,62,,,62215000AV0362,,,,,,,,,,,,,0,1,Maison,127,3,S,sols,,,510,2.976841,50.489858
2021-1039850,2021-02-01,000001,Vente,72000,42,,HAM MAGENTA,A242,62220,62215,Carvin,62,,,62215000ZE0183,,,,,,,,,,,,,0,3,Dépendance,,0,S,sols,,,234,2.929726,50.504482
2021-1039850,2021-02-01,000001,Vente,72000,42,,HAM MAGENTA,A242,62220,62215,Carvin,62,,,62215000ZE0183,,,,,,,,,,,,,0,3,Dépendance,,0,S,sols,,,234,2.929726,50.504482
2021-1039850,2021-02-01,000001,Vente,72000,42,,HAM MAGENTA,A242,62220,62215,Carvin,62,,,62215000ZE0183,,,,,,,,,,,,,0,1,Maison,73,4,S,sols,,,234,2.929726,50.504482
2021-1039857,2021-01-29,000001,Vente,2111.2,,,LE MARAIS DE CARVIN,B035,62220,62215,Carvin,62,,,62215000ZL0077,,,,,,,,,,,,,0,,,,,T,terres,,,8070,2.967183,50.483861
2021-1039857,2021-01-29,000001,Vente,2111.2,,,LE MARAIS DE CARVIN,B035,62220,62215,Carvin,62,,,62215000ZL0078,,,,,,,,,,,,,0,,,,,T,terres,,,1243,2.966319,50.483869
2021-1039864,2021-02-05,000001,Vente,151995,20,,RUE URIANE SORRIAUX,0740,62220,62215,Carvin,62,,,62215000AH0013,,,,,,,,,,,,,0,3,Dépendance,,0,S,sols,,,172,2.951999,50.485433
2021-1039864,2021-02-05,000001,Vente,151995,20,,RUE URIANE SORRIAUX,0740,62220,62215,Carvin,62,,,62215000AH0013,,,,,,,,,,,,,0,1,Maison,80,3,S,sols,,,172,2.951999,50.485433
2021-1039866,2021-01-25,000001,Vente,33000,,,LES NONETTES,B041,62220,62215,Carvin,62,,,62215000ZO0214,,,,,,,,,,,,,0,,,,,AB,terrains a bâtir,,,352,2.926406,50.471308
2021-1039955,2021-02-11,000001,Vente,74000,98,,RUE THIBAUT,0690,62220,62215,Carvin,62,,,62215000AD0657,,,,,,,,,,,,,0,4,Local industriel. commercial ou assimilé,14,0,S,sols,,,46,2.959212,50.486331
2021-1039955,2021-02-11,000001,Vente,74000,98,,RUE THIBAUT,0690,62220,62215,Carvin,62,,,62215000AD0657,,,,,,,,,,,,,0,4,Local industriel. commercial ou assimilé,20,0,S,sols,,,46,2.959212,50.486331
2021-1039988,2021-01-29,000001,Vente,149000,1,,ALL CHARMES CITE POLLET,0115,62220,62215,Carvin,62,,,62215000AN0340,,,,,,,,,,,,,0,1,Maison,78,4,S,sols,,,330,2.952382,50.493098
2021-1039996,2021-02-09,000001,Vente,166000,27,,RTE DE PROVIN,0590,62220,62215,Carvin,62,,,62215000AN0429,,,,,,,,,,,,,0,1,Maison,76,4,S,sols,,,293,2.949389,50.494118
2021-1039998,2021-01-29,000001,Vente,79000,,,LES ECUSSONS NORD,B015,62220,62215,Carvin,62,,,62215000ZK0410,,,,,,,,,,,,,0,,,,,AB,terrains a bâtir,,,387,2.975637,50.498192
2021-1039998,2021-01-29,000001,Vente,79000,,,LES ECUSSONS NORD,B015,62220,62215,Carvin,62,,,62215000ZK0446,,,,,,,,,,,,,0,,,,,AB,terrains a bâtir,,,62,2.975588,50.49834
2021-1040000,2021-02-10,000001,Vente,73500,4,,RUE URIANE SORRIAUX,0740,62220,62215,Carvin,62,,,62215000AH0002,,,,,,,,,,,,,0,1,Maison,45,3,S,sols,,,45,2.952252,50.485829
2021-1040002,2021-01-15,000001,Vente,87000,99,,RUE FRANCIS DE PRESSENSE,0270,62220,62215,Carvin,62,,,62215000AD0756,,,,,,,,,,,,,0,1,Maison,97,5,S,sols,,,65,2.954615,50.489214
2021-1040004,2021-02-01,000001,Vente,221511,18,,RUE DES EDELWEISS,0146,62220,62215,Carvin,62,,,62215000AB0942,,,,,,,,,,,,,0,1,Maison,106,5,S,sols,,,337,2.964399,50.497258
2021-1040010,2021-02-05,000001,Vente,125000,51,,RUE DES PAPILLONS,0520,62220,62215,Carvin,62,,,62215000AE0150,,,,,,,,,,,,,0,3,Dépendance,,0,S,sols,,,400,2.956861,50.48449
2021-1040010,2021-02-05,000001,Vente,125000,51,,RUE DES PAPILLONS,0520,62220,62215,Carvin,62,,,62215000AE0150,,,,,,,,,,,,,0,1,Maison,86,4,S,sols,,,400,2.956861,50.48449
2021-1040088,2021-02-11,000001,Vente,122500,95,,RUE DES FUSILLES,0300,62220,62215,Carvin,62,,,62215000AE0149,,,,,,,,,,,,,0,1,Maison,90,4,S,sols,,,257,,
2021-1040088,2021-02-11,000001,Vente,122500,95,,RUE DES FUSILLES,0300,62220,62215,Carvin,62,,,62215000AE0149,,,,,,,,,,,,,0,1,Maison,90,4,J,jardins,,,560,,
2021-1040142,2021-02-15,000001,Vente,161250,100,,RUE DU CHEMIN VERT,0110,62220,62215,Carvin,62,,,62215000AW0529,,,,,,,,,,,,,0,1,Maison,90,4,S,sols,,,203,2.968744,50.491551
2021-1040193,2021-02-18,000001,Vente,35000,,,EPINOY SUD,B019,62220,62215,Carvin,62,,,62215000AH0208,,,,,,,,,,,,,0,,,,,J,jardins,,,1000,2.950565,50.484719
2021-1040255,2021-02-22,000001,Vente en l'état futur d'achèvement,108000,,,,,,62215,Carvin,62,,,62215000AN0691,,,23,,,,,,,,,,1,,,,,,,,,,2.955013,50.491452
2021-1040255,2021-02-22,000001,Vente en l'état futur d'achèvement,108000,,,,,,62215,Carvin,62,,,62215000AN0691,,,2,,,,,,,,,,1,,,,,,,,,,2.955013,50.491452
2021-1040291,2021-02-18,000001,Vente,4695,,,LES NONETTES,B041,62220,62215,Carvin,62,,,62215000ZO0237,,,,,,,,,,,,,0,,,,,T,terres,,,313,2.926331,50.470784
2021-1040445,2021-03-01,000001,Vente,86000,4,,RLE DE CARNIN,0083,62220,62215,Carvin,62,,,62215000AP0292,,,,,,,,,,,,,0,1,Maison,80,3,S,sols,,,110,2.956319,50.498578
2021-1040448,2021-02-26,000001,Vente en l'état futur d'achèvement,132000,2,,RUE THIBAUT,0690,62220,62215,Carvin,62,,,62215000AC0003,,,4,,,,,,,,,,1,2,Appartement,50,3,,,,,,2.957006,50.490712
2021-1040448,2021-02-26,000001,Vente en l'état futur d'achèvement,132000,2,,RUE THIBAUT,0690,62220,62215,Carvin,62,,,62215000AC0003,,,408,,,,,,,,,,1,3,Dépendance,,0,,,,,,2.957006,50.490712
2021-1040451,2021-02-18,000001,Vente,50000,,,LE MARAIS D EPINOY,B034,62220,62215,Carvin,62,,,62215000AZ0144,,,,,,,,,,,,,0,,,,,T,terres,,,3091,2.96605,50.476893
2021-1040452,2021-02-26,000001,Vente,205000,1,,RUE DE MONTAUBAN,0452,62220,62215,Carvin,62,,,62215000ZN0326,,,,,,,,,,,,,0,1,Maison,80,5,S,sols,,,380,2.941547,50.47541
2021-1040458,2021-03-02,000001,Vente,227000,82,,RUE JEAN MOULIN,0361,62220,62215,Carvin,62,,,62215000AC0266,,,,,,,,,,,,,0,1,Maison,136,6,S,sols,,,350,2.963537,50.492109
2021-1040476,2021-02-12,000002,Vente,140000,81,,RUE CYPRIEN QUINET,0128,62220,62215,Carvin,62,,,62215000AW0626,,,,,,,,,,,,,0,3,Dépendance,,0,S,sols,,,301,2.97445,50.49171
2021-1040476,2021-02-12,000002,Vente,140000,81,,RUE CYPRIEN QUINET,0128,62220,62215,Carvin,62,,,62215000AW0626,,,,,,,,,,,,,0,1,Maison,145,5,S,sols,,,301,2.97445,50.49171
2021-1040479,2021-03-04,000001,Vente,134090,312,,RUE DU TILLOY,0710,62220,62215,Carvin,62,,,62215000AC0674,,,,,,,,,,,,,0,1,Maison,89,4,S,sols,,,102,2.962215,50.490924
2021-1040482,2021-03-04,000001,Vente,141700,26,,RUE DES PAPILLONS,0520,62220,62215,Carvin,62,,,62215000AE0197,,,,,,,,,,,,,0,3,Dépendance,,0,S,sols,,,186,2.957424,50.485118
2021-1040482,2021-03-04,000001,Vente,141700,26,,RUE DES PAPILLONS,0520,62220,62215,Carvin,62,,,62215000AE0197,,,,,,,,,,,,,0,3,Dépendance,,0,S,sols,,,186,2.957424,50.485118
2021-1040482,2021-03-04,000001,Vente,141700,26,,RUE DES PAPILLONS,0520,62220,62215,Carvin,62,,,62215000AE0197,,,,,,,,,,,,,0,1,Maison,54,3,S,sols,,,186,2.957424,50.485118
2021-1040507,2021-02-24,000001,Vente,221400,7,,RUE DES EPERVIERS,0191,62220,62215,Carvin,62,,,62215000ZL0494,,,,,,,,,,,,,0,1,Maison,74,3,S,sols,,,92,2.964614,50.487937
2021-1040507,2021-02-24,000001,Vente,221400,,,LE MARAIS DE CARVIN,B035,62220,62215,Carvin,62,,,62215000ZL0634,,,,,,,,,,,,,0,,,,,S,sols,,,114,2.964822,50.487967
2021-1040507,2021-02-24,000001,Vente,221400,,,LE MARAIS DE CARVIN,B035,62220,62215,Carvin,62,,,62215000ZL0646,,,,,,,,,,,,,0,,,,,S,sols,,,54,2.96476,50.487955
2021-1040507,2021-02-24,000001,Vente,221400,,,LE MARAIS DE CARVIN,B035,62220,62215,Carvin,62,,,62215000ZL0653,,,,,,,,,,,,,0,,,,,S,sols,,,123,2.964676,50.48795
2021-1040584,2021-03-01,000001,Vente,52000,32,,RUE RAOUL BRIQUET,0600,62220,62215,Carvin,62,,,62215000AD0352,,,,,,,,,,,,,0,1,Maison,100,6,S,sols,,,113,2.956271,50.486525
2021-1040584,2021-03-01,000001,Vente,52000,5007,F,RUE RAOUL BRIQUET,0600,62220,62215,Carvin,62,,,62215000AD0689,,,,,,,,,,,,,0,3,Dépendance,,0,AB,terrains a bâtir,,,16,2.958072,50.486179
2021-1040591,2021-03-10,000001,Vente,138500,5009,F,RUE DES FUSILLES,0300,62220,62215,Carvin,62,,,62215000AE0139,,,,,,,,,,,,,0,1,Maison,106,5,S,sols,,,231,2.95779,50.484576
2021-1040591,2021-03-10,000001,Vente,138500,,,RUE DES PAPILLONS,0520,62220,62215,Carvin,62,,,62215000AE0435,,,,,,,,,,,,,0,,,,,S,sols,,,45,2.957757,50.484563
2021-1040592,2021-03-10,000001,Vente,168000,66,B,RUE CYPRIEN QUINET,0128,62220,62215,Carvin,62,,,62215000AX0211,,,,,,,,,,,,,0,1,Maison,78,4,S,sols,,,199,2.973183,50.491272
2021-1040605,2021-03-10,000001,Vente,15000,,,RUE RAOUL BRIQUET,0600,62220,62215,Carvin,62,,,62215000AD0311,,,,,,,,,,,,,0,,,,,J,jardins,,,423,2.956311,50.486896
2021-1040605,2021-03-10,000001,Vente,15000,,,RUE RAOUL BRIQUET,0600,62220,62215,Carvin,62,,,62215000AD0311,,,,,,,,,,,,,0,,,,,S,sols,,,186,2.956311,50.486896
2021-1040615,2021-02-18,000001,Vente,125900,74,,RUE DE L EGALITE,0150,62220,62215,Carvin,62,,,62215000AP0341,,,,,,,,,,,,,0,1,Maison,96,5,S,sols,,,296,2.954642,50.499017
2021-1040649,2021-03-12,000001,Vente,79000,,,LES ECUSSONS NORD,B015,62220,62215,Carvin,62,,,62215000ZK0411,,,,,,,,,,,,,0,,,,,AB,terrains a bâtir,,,386,2.97584,50.498244
2021-1040649,2021-03-12,000001,Vente,79000,,,LES ECUSSONS NORD,B015,62220,62215,Carvin,62,,,62215000ZK0447,,,,,,,,,,,,,0,,,,,AB,terrains a bâtir,,,64,2.975791,50.498393
2021-1040651,2021-03-12,000001,Vente,70000,,,LES ECUSSONS NORD,B015,62220,62215,Carvin,62,,,62215000ZK0408,,,,,,,,,,,,,0,,,,,AB,terrains a bâtir,,,144,2.975307,50.498106
2021-1040651,2021-03-12,000001,Vente,70000,,,LES ECUSSONS NORD,B015,62220,62215,Carvin,62,,,62215000ZK0435,,,,,,,,,,,,,0,,,,,AB,terrains a bâtir,,,286,2.975212,50.498099
2021-1040651,2021-03-12,000001,Vente,70000,,,LES ECUSSONS NORD,B015,62220,62215,Carvin,62,,,62215000ZK0444,,,,,,,,,,,,,0,,,,,AB,terrains a bâtir,,,20,2.975238,50.498248
2021-1040688,2021-03-03,000001,Vente,66000,,,CITE SAINT JEAN,B009,62220,62215,Carvin,62,,,62215000BD0719,,,,,,,,,,,,,0,,,,,AB,terrains a bâtir,,,392,2.942579,50.471808
2021-1040688,2021-03-03,000001,Vente,66000,,,LE CORNET LAURENT,B013,62220,62215,Carvin,62,,,62215000ZN0383,,,,,,,,,,,,,0,,,,,AB,terrains a bâtir,,,67,2.942681,50.471767
2021-1040689,2021-03-02,000001,Vente,69000,,,CITE SAINT JEAN,B009,62220,62215,Carvin,62,,,62215000BD0712,,,,,,,,,,,,,0,,,,,AB,terrains a bâtir,,,510,2.942235,50.472147
2021-1040690,2021-03-02,000001,Vente,60000,,,CITE SAINT JEAN,B009,62220,62215,Carvin,62,,,62215000BD0708,,,,,,,,,,,,,0,,,,,AB,terrains a bâtir,,,464,2.941653,50.471767
2021-1040691,2021-03-05,000001,Vente,71000,,,CITE SAINT JEAN,B009,62220,62215,Carvin,62,,,62215000BD0717,,,,,,,,,,,,,0,,,,,AB,terrains a bâtir,,,550,2.942284,50.471697
2021-1040692,2021-03-04,000001,Vente,64000,,,LE CORNET LAURENT,B013,62220,62215,Carvin,62,,,62215000ZN0364,,,,,,,,,,,,,0,,,,,AB,terrains a bâtir,,,476,2.943593,50.47199
2021-1040696,2021-03-05,000001,Vente,85000,60,B,RUE SERAPHIN CORDIER,0660,62220,62215,Carvin,62,,,62215000AP0174,,,,,,,,,,,,,0,1,Maison,105,3,S,sols,,,223,2.958081,50.499335
2021-1040696,2021-03-05,000001,Vente,85000,60,B,RUE SERAPHIN CORDIER,0660,62220,62215,Carvin,62,,,62215000AP0174,,,,,,,,,,,,,0,1,Maison,51,2,S,sols,,,223,2.958081,50.499335
2021-1040730,2021-03-16,000001,Vente,262000,29,,RUE DES HERONS,0346,62220,62215,Carvin,62,,,62215000ZL0689,,,,,,,,,,,,,0,1,Maison,99,5,S,sols,,,343,2.966261,50.487267
2021-1040742,2021-03-03,000001,Vente,71000,,,LE CORNET LAURENT,B013,62220,62215,Carvin,62,,,62215000ZN0363,,,,,,,,,,,,,0,,,,,AB,terrains a bâtir,,,505,2.943557,50.472171
2021-1040743,2021-03-03,000001,Vente,74000,,,LE CORNET LAURENT,B013,62220,62215,Carvin,62,,,62215000ZN0368,,,,,,,,,,,,,0,,,,,AB,terrains a bâtir,,,586,2.943709,50.471391
2021-1040744,2021-03-03,000001,Vente,77000,,,CITE SAINT JEAN,B009,62220,62215,Carvin,62,,,62215000BD0711,,,,,,,,,,,,,0,,,,,AB,terrains a bâtir,,,637,2.941931,50.472179
2021-1040802,2021-03-19,000001,Vente,145000,96,,RUE URIANE SORRIAUX,0740,62220,62215,Carvin,62,,,62215000AH0251,,,,,,,,,,,,,0,1,Maison,82,3,S,sols,,,198,2.952289,50.482815
2021-1040899,2021-03-12,000001,Vente,290900,866,,RUE SERAPHIN CORDIER,0660,62220,62215,Carvin,62,,,62215000ZA0363,,,,,,,,,,,,,0,1,Maison,152,5,S,sols,,,1000,2.952968,50.504465
2021-1040899,2021-03-12,000001,Vente,290900,866,,RUE SERAPHIN CORDIER,0660,62220,62215,Carvin,62,,,62215000ZA0363,,,,,,,,,,,,,0,1,Maison,152,5,J,jardins,,,456,2.952968,50.504465
2021-1040904,2021-02-27,000001,Vente,160000,7,B,RUE DE LA GARE PROLONGEE,0351,62220,62215,Carvin,62,,,62215000AM0158,,,,,,,,,,,,,0,3,Dépendance,,0,S,sols,,,397,2.949119,50.493303
2021-1040904,2021-02-27,000001,Vente,160000,7,B,RUE DE LA GARE PROLONGEE,0351,62220,62215,Carvin,62,,,62215000AM0158,,,,,,,,,,,,,0,1,Maison,94,5,S,sols,,,397,2.949119,50.493303
2021-1040928,2021-02-10,000001,Vente,150000,92,,RUE DU CHEMIN VERT,0110,62220,62215,Carvin,62,,,62215000AW0530,,,,,,,,,,,,,0,1,Maison,104,5,S,sols,,,210,2.968637,50.491568
2021-1040932,2021-03-12,000001,Vente,70000,,,LE CORNET LAURENT,B013,62220,62215,Carvin,62,,,62215000ZN0378,,,,,,,,,,,,,0,,,,,AB,terrains a bâtir,,,512,2.943194,50.471832
2021-1040957,2021-03-23,000001,Vente,131036,23,B,RUE ETIENNE DOLET,0230,62220,62215,Carvin,62,,,62215000AB0959,,,,,,,,,,,,,0,1,Maison,87,6,S,sols,,,87,2.961924,50.498477
2021-1040957,2021-03-23,000001,Vente,131036,23,B,RUE ETIENNE DOLET,0230,62220,62215,Carvin,62,,,62215000AB0960,,3,,,,,,,,,,,0,,,,,,,,,,2.961911,50.498418
2021-1040959,2021-03-11,000001,Vente,106000,132,,RUE FLORENT EVRARD,0240,62220,62215,Carvin,62,,,62215000AK0200,,,,,,,,,,,,,0,3,Dépendance,,0,S,sols,,,360,2.944478,50.485155
2021-1040959,2021-03-11,000001,Vente,106000,132,,RUE FLORENT EVRARD,0240,62220,62215,Carvin,62,,,62215000AK0200,,,,,,,,,,,,,0,1,Maison,106,7,S,sols,,,360,2.944478,50.485155
2021-1040964,2021-03-15,000001,Vente,70000,,,CITE SAINT JEAN,B009,62220,62215,Carvin,62,,,62215000BD0709,,,,,,,,,,,,,0,,,,,AB,terrains a bâtir,,,529,2.941661,50.471957
2021-1040966,2021-03-18,000001,Vente,72000,,,LE CORNET LAURENT,B013,62220,62215,Carvin,62,,,62215000ZN0379,,,,,,,,,,,,,0,,,,,AB,terrains a bâtir,,,549,2.943159,50.471667
2021-1041006,2021-03-29,000001,Vente,72000,,,CITE SAINT JEAN,B009,62220,62215,Carvin,62,,,62215000BD0713,,,,,,,,,,,,,0,,,,,AB,terrains a bâtir,,,554,2.942481,50.472154
2021-1041032,2021-03-15,000001,Vente,100000,9,,RUE DU MARECHAL JOFFRE,0460,62220,62215,Carvin,62,,,62215000AH0148,,,,,,,,,,,,,0,1,Maison,70,4,S,sols,,,92,2.945936,50.484862
2021-1041043,2021-03-24,000001,Vente,120000,99,,RUE FACADE,0235,62220,62215,Carvin,62,,,62215000BD0148,,,,,,,,,,,,,0,1,Maison,10,1,S,sols,,,491,2.940818,50.4717
2021-1041043,2021-03-24,000001,Vente,120000,99,,RUE FACADE,0235,62220,62215,Carvin,62,,,62215000BD0148,,,,,,,,,,,,,0,1,Maison,50,3,S,sols,,,491,2.940818,50.4717
2021-1041059,2021-03-24,000001,Vente,2039.2,,,LA LAMPE NORD,B032,62220,62215,Carvin,62,,,62215000ZC0190,,,,,,,,,,,,,0,,,,,T,terres,,,2549,2.970506,50.508273
2021-1041095,2021-03-30,000001,Vente,11000,,,LA LAMPE SUD,B033,62220,62215,Carvin,62,,,62215000AP0368,,,,,,,,,,,,,0,,,,,J,jardins,,,813,2.955896,50.49966
2021-1041215,2021-03-23,000001,Vente,45969368,,,LE MARAIS D EPINOY,B034,62220,62215,Carvin,62,,,62215000ZM0252,,,,,,,,,,,,,0,,,,,S,sols,,,1286,2.962589,50.473817
2021-1041215,2021-03-23,000001,Vente,45969368,,,LE MARAIS D EPINOY,B034,62220,62215,Carvin,62,,,62215000ZM0254,,,,,,,,,,,,,0,,,,,S,sols,,,12707,2.960078,50.473096
2021-1041215,2021-03-23,000001,Vente,45969368,8002,F,RUE ELIE CARTAN,0169,62220,62215,Carvin,62,,,62215000ZM0259,,,,,,,,,,,,,0,4,Local industriel. commercial ou assimilé,,0,S,sols,,,3865,2.959282,50.473028
2021-1041215,2021-03-23,000001,Vente,45969368,17,,RUE LOUIS JOSEPH GAY LUSSAC,0305,62220,62215,Carvin,62,,,62215000ZM0384,,,,,,,,,,,,,0,4,Local industriel. commercial ou assimilé,21559,0,S,sols,,,45077,2.961427,50.47276
2021-1041215,2021-03-23,000001,Vente,45969368,,,LE MARAIS D EPINOY,B034,62220,62215,Carvin,62,,,62215000ZM0388,,,,,,,,,,,,,0,,,,,S,sols,,,12103,2.962911,50.473922
2021-1041255,2021-04-08,000001,Vente,80000,43,T,RUE ARTHUR LAMENDIN,0010,62220,62215,Carvin,62,,,62215000AD0355,,,,,,,,,,,,,0,1,Maison,65,2,S,sols,,,54,2.956136,50.486188
2021-1041283,2021-04-09,000001,Vente,10000,,,RUE DU 19 MARS 1962,0134,62220,62215,Carvin,62,,,62215000AC0926,,,,,,,,,,,,,0,,,,,S,sols,,,356,2.961891,50.491438
2021-1041284,2021-04-09,000001,Vente,155000,22,,RUE RAOUL BRIQUET,0600,62220,62215,Carvin,62,,,62215000AD0325,,,,,,,,,,,,,0,3,Dépendance,,0,S,sols,,,230,2.957705,50.48677