id_mutation,date_mutation,numero_disposition,nature_mutation,valeur_fonciere,adresse_numero,adresse_suffixe,adresse_nom_voie,adresse_code_voie,code_postal,code_commune,nom_commune,code_departement,ancien_code_commune,ancien_nom_commune,id_parcelle,ancien_id_parcelle,numero_volume,lot1_numero,lot1_surface_carrez,lot2_numero,lot2_surface_carrez,lot3_numero,lot3_surface_carrez,lot4_numero,lot4_surface_carrez,lot5_numero,lot5_surface_carrez,nombre_lots,code_type_local,type_local,surface_reelle_bati,nombre_pieces_principales,code_nature_culture,nature_culture,code_nature_culture_speciale,nature_culture_speciale,surface_terrain,longitude,latitude
2021-1049599,2021-01-29,000001,Vente,162934,,,CANTON DU BUISSON DE L ENF,B016,62360,62446,Hesdigneul-lès-Boulogne,62,,,62446000AH0178,,,,,,,,,,,,,0,,,,,S,sols,,,3,1.661321,50.659082
2021-1049599,2021-01-29,000001,Vente,162934,48,,RUE DES BUISSONS FLEURIS,0006,62360,62446,Hesdigneul-lès-Boulogne,62,,,62446000AH0193,,,,,,,,,,,,,0,1,Maison,86,4,S,sols,,,441,1.661442,50.658977
2021-1050741,2021-04-08,000002,Vente,1,,,CANTON DU BUISSON DE L ENF,B016,62360,62446,Hesdigneul-lès-Boulogne,62,,,62446000AH0228,,,,,,,,,,,,,0,,,,,AB,terrains a bâtir,,,2414,1.661352,50.658778
2021-1050741,2021-04-08,000002,Vente,1,,,CANTON DU BUISSON DE L ENF,B016,62360,62446,Hesdigneul-lès-Boulogne,62,,,62446000AH0248,,,,,,,,,,,,,0,,,,,BS,taillis sous futaie,,,6267,1.660226,50.659175
2021-1050865,2021-04-23,000001,Vente,50000,,,CANTON DES HAMIAUX,B010,62360,62446,Hesdigneul-lès-Boulogne,62,,,62446000AD0174,,,,,,,,,,,,,0,,,,,S,sols,,,634,1.681849,50.655537
2021-1051012,2021-04-28,000001,Vente terrain à bâtir,64180,,,CANTON DU BUISSON DE L ENF,B016,62360,62446,Hesdigneul-lès-Boulogne,62,,,62446000AH0206,,,,,,,,,,,,,0,,,,,AB,terrains a bâtir,,,573,1.659193,50.659246
2021-1051012,2021-04-28,000001,Vente terrain à bâtir,64180,,,CANTON DU BUISSON DE L ENF,B016,62360,62446,Hesdigneul-lès-Boulogne,62,,,62446000AH0233,,,,,,,,,,,,,0,,,,,AB,terrains a bâtir,,,7,1.659387,50.659317
2021-1051055,2021-04-28,000001,Vente,73000,,,LE VILLAGE,B027,62360,62446,Hesdigneul-lès-Boulogne,62,,,62446000AC0003,,,5,,9,,,,,,,,2,2,Appartement,75,4,,,,,,1.668755,50.660748
2021-1051563,2021-06-08,000001,Vente,112100,33,,RTE DE PONT DE BRIQUES,0019,62360,62446,Hesdigneul-lès-Boulogne,62,,,62446000AB0221,,,,,,,,,,,,,0,3,Dépendance,,0,S,sols,,,284,1.661697,50.660166
2021-1051563,2021-06-08,000001,Vente,112100,33,,RTE DE PONT DE BRIQUES,0019,62360,62446,Hesdigneul-lès-Boulogne,62,,,62446000AB0221,,,,,,,,,,,,,0,1,Maison,51,3,S,sols,,,284,1.661697,50.660166
2021-1051564,2021-06-10,000001,Vente,65000,,,CANTON DES TERRES PENDANTE,B015,62360,62446,Hesdigneul-lès-Boulogne,62,,,62446000AH0129,,,,,,,,,,,,,0,,,,,AB,terrains a bâtir,,,291,1.66827,50.657928
2021-1051564,2021-06-10,000001,Vente,65000,,,CANTON DES TERRES PENDANTE,B015,62360,62446,Hesdigneul-lès-Boulogne,62,,,62446000AH0145,,,,,,,,,,,,,0,,,,,AB,terrains a bâtir,,,47,1.66832,50.657852
2021-1051564,2021-06-10,000001,Vente,65000,,,CANTON DES TERRES PENDANTE,B015,62360,62446,Hesdigneul-lès-Boulogne,62,,,62446000AH0176,,,,,,,,,,,,,0,,,,,T,terres,,,111,1.668249,50.657816
2021-1051564,2021-06-10,000001,Vente,65000,,,CANTON DES TERRES PENDANTE,B015,62360,62446,Hesdigneul-lès-Boulogne,62,,,62446000AH0240,,,,,,,,,,,,,0,,,,,AB,terrains a bâtir,,,37,1.668449,50.657931
2021-1051564,2021-06-10,000001,Vente,65000,,,CANTON DES TERRES PENDANTE,B015,62360,62446,Hesdigneul-lès-Boulogne,62,,,62446000AH0241,,,,,,,,,,,,,0,,,,,AB,terrains a bâtir,,,4,1.668453,50.657851
2021-1051564,2021-06-10,000001,Vente,65000,,,CANTON DES TERRES PENDANTE,B015,62360,62446,Hesdigneul-lès-Boulogne,62,,,62446000AH0244,,,,,,,,,,,,,0,,,,,T,terres,,,9,1.668454,50.657821
2021-1051743,2021-06-10,000001,Vente,1,,,CANTON DES TERRES PENDANTE,B015,62360,62446,Hesdigneul-lès-Boulogne,62,,,62446000AH0236,,,,,,,,,,,,,0,,,,,AB,terrains a bâtir,,,10,1.669869,50.657452
2021-1052070,2021-06-29,000001,Vente,159786,34,,RUE DES BUISSONS FLEURIS,0006,62360,62446,Hesdigneul-lès-Boulogne,62,,,62446000AH0221,,,,,,,,,,,,,0,1,Maison,86,4,S,sols,,,276,1.660155,50.659047
2021-1052108,2021-07-02,000001,Vente,264500,76,,RTE DE PONT DE BRIQUES,0019,62360,62446,Hesdigneul-lès-Boulogne,62,,,62446000AB0247,,,,,,,,,,,,,0,1,Maison,102,4,S,sols,,,574,1.658835,50.661676
2021-1052238,2021-06-30,000001,Vente,1500000,,,PRES DU MARAIS,B026,62360,62446,Hesdigneul-lès-Boulogne,62,,,62446000AB0157,,,,,,,,,,,,,0,,,,,T,terres,,,21474,1.663782,50.661495
2021-1052238,2021-06-30,000001,Vente,1500000,,,PRES DU MARAIS,B026,62360,62446,Hesdigneul-lès-Boulogne,62,,,62446000AB0157,,,,,,,,,,,,,0,,,,,S,sols,,,814,1.663782,50.661495
2021-1052238,2021-06-30,000001,Vente,1500000,,,PRES DU MARAIS,B026,62360,62446,Hesdigneul-lès-Boulogne,62,,,62446000AB0218,,,,,,,,,,,,,0,,,,,S,sols,,,12,1.662081,50.660615
2021-1052238,2021-06-30,000001,Vente,1500000,,,PRES DU MARAIS,B026,62360,62446,Hesdigneul-lès-Boulogne,62,,,62446000AB0219,,,,,,,,,,,,,0,,,,,S,sols,,,430,1.662206,50.661156
2021-1052238,2021-06-30,000001,Vente,1500000,,,RTE DE PONT DE BRIQUES,0019,62360,62446,Hesdigneul-lès-Boulogne,62,,,62446000AB0266,,,,,,,,,,,,,0,,,,,S,sols,,,8,1.661953,50.660624
2021-1052238,2021-06-30,000001,Vente,1500000,37,,RTE DE PONT DE BRIQUES,0019,62360,62446,Hesdigneul-lès-Boulogne,62,,,62446000AB0268,,,,,,,,,,,,,0,4,Local industriel. commercial ou assimilé,6935,0,S,sols,,,34233,1.660635,50.661466
2021-1052267,2021-07-19,000001,Vente,237000,3,,RTE DE CONDETTE,0012,62360,62446,Hesdigneul-lès-Boulogne,62,,,62446000AC0150,,,,,,,,,,,,,0,3,Dépendance,,0,S,sols,,,288,1.674624,50.656179
2021-1052267,2021-07-19,000001,Vente,237000,3,,RTE DE CONDETTE,0012,62360,62446,Hesdigneul-lès-Boulogne,62,,,62446000AC0150,,,,,,,,,,,,,0,1,Maison,114,5,S,sols,,,288,1.674624,50.656179
2021-1052267,2021-07-19,000001,Vente,237000,,,CANTON DES PCES PAUCHET,B012,62360,62446,Hesdigneul-lès-Boulogne,62,,,62446000AC0151,,,,,,,,,,,,,0,,,,,J,jardins,,,801,1.674174,50.656196
2021-1052353,2021-07-09,000001,Vente,1,,,CANTON DES TERRES PENDANTE,B015,62360,62446,Hesdigneul-lès-Boulogne,62,,,62446000AH0246,,,,,,,,,,,,,0,,,,,AB,terrains a bâtir,,,29,1.668862,50.657737
2021-1052353,2021-07-09,000001,Vente,1,,,CANTON DES TERRES PENDANTE,B015,62360,62446,Hesdigneul-lès-Boulogne,62,,,62446000AH0245,,,,,,,,,,,,,0,,,,,AB,terrains a bâtir,,,28,1.668748,50.657766
2021-1052355,2021-07-13,000001,Vente,,20,,RTE DE PONT DE BRIQUES,0019,62360,62446,Hesdigneul-lès-Boulogne,62,,,62446000AB0195,,,,,,,,,,,,,0,1,Maison,60,4,S,sols,,,231,1.664059,50.660015
2021-1052432,2021-07-13,000001,Vente,273000,,,HAM DU MONT AIGU,B021,62360,62446,Hesdigneul-lès-Boulogne,62,,,62446000AE0069,,,,,,,,,,,,,0,,,,,J,jardins,,,770,1.674709,50.648065
2021-1052432,2021-07-13,000001,Vente,273000,28,,RUE DE MONTAIGU,0018,62360,62446,Hesdigneul-lès-Boulogne,62,,,62446000AE0070,,,,,,,,,,,,,0,1,Maison,108,5,S,sols,,,266,1.674586,50.647919
2021-1052432,2021-07-13,000001,Vente,273000,,,HAM DU MONT AIGU,B021,62360,62446,Hesdigneul-lès-Boulogne,62,,,62446000AE0104,,,,,,,,,,,,,0,,,,,P,prés,,,1785,1.674941,50.648353
2021-1052562,2021-06-25,000001,Vente,63000,,,CANTON DES TERRES PENDANTE,B015,62360,62446,Hesdigneul-lès-Boulogne,62,,,62446000AH0238,,,,,,,,,,,,,0,,,,,AB,terrains a bâtir,,,77,1.668716,50.657935
2021-1052562,2021-06-25,000001,Vente,63000,,,CANTON DES TERRES PENDANTE,B015,62360,62446,Hesdigneul-lès-Boulogne,62,,,62446000AH0239,,,,,,,,,,,,,0,,,,,AB,terrains a bâtir,,,314,1.668591,50.657948
2021-1052562,2021-06-25,000001,Vente,63000,,,CANTON DES TERRES PENDANTE,B015,62360,62446,Hesdigneul-lès-Boulogne,62,,,62446000AH0242,,,,,,,,,,,,,0,,,,,AB,terrains a bâtir,,,32,1.668596,50.65785
2021-1052562,2021-06-25,000001,Vente,63000,,,CANTON DES TERRES PENDANTE,B015,62360,62446,Hesdigneul-lès-Boulogne,62,,,62446000AH0243,,,,,,,,,,,,,0,,,,,T,terres,,,39,1.668539,50.657821
2021-1052578,2021-07-16,000001,Vente,237450,24,,RTE DE PONT DE BRIQUES,0019,62360,62446,Hesdigneul-lès-Boulogne,62,,,62446000AB0108,,,,,,,,,,,,,0,1,Maison,120,5,S,sols,,,891,1.663672,50.659755
2021-1053780,2021-10-14,000001,Vente,162680,22,,RUE DES BUISSONS FLEURIS,0006,62360,62446,Hesdigneul-lès-Boulogne,62,,,62446000AH0215,,,,,,,,,,,,,0,1,Maison,83,4,S,sols,,,273,1.659993,50.659665
2021-1053793,2021-10-18,000001,Vente terrain à bâtir,71180,,,CANTON DU BUISSON DE L ENF,B016,62360,62446,Hesdigneul-lès-Boulogne,62,,,62446000AH0201,,,,,,,,,,,,,0,,,,,AB,terrains a bâtir,,,634,1.66006,50.658865
2021-1053793,2021-10-18,000001,Vente terrain à bâtir,71180,,,CANTON DU BUISSON DE L ENF,B016,62360,62446,Hesdigneul-lès-Boulogne,62,,,62446000AH0229,,,,,,,,,,,,,0,,,,,AB,terrains a bâtir,,,10,1.660031,50.65897
2021-1053827,2021-10-27,000001,Vente,32000,,,CANTON BOUDINETTE,B005,62360,62446,Hesdigneul-lès-Boulogne,62,,,62446000AD0241,,,,,,,,,,,,,0,,,,,AB,terrains a bâtir,,,325,1.681926,50.656023
2021-1053827,2021-10-27,000001,Vente,32000,,,CANTON BOUDINETTE,B005,62360,62446,Hesdigneul-lès-Boulogne,62,,,62446000AD0242,,,,,,,,,,,,,0,,,,,S,sols,,,81,1.681815,50.65584
2021-1053827,2021-10-27,000001,Vente,32000,,,BOUDINETTES,B004,62360,62446,Hesdigneul-lès-Boulogne,62,,,62446000AD0245,,,,,,,,,,,,,0,,,,,S,sols,,,3,1.681834,50.656093
2021-1053954,2021-10-13,000001,Vente,369900,18,,RUE JULES VERLINGUE,0015,62360,62446,Hesdigneul-lès-Boulogne,62,,,62446000AH0081,,,,,,,,,,,,,0,1,Maison,143,4,S,sols,,,730,1.666035,50.658395
2021-1054093,2021-10-28,000001,Vente,115000,21,,RUE DES PRETRES,0020,62360,62446,Hesdigneul-lès-Boulogne,62,,,62446000AC0164,,,,,,,,,,,,,0,1,Maison,76,4,S,sols,,,395,1.67015,50.658881
2021-1054093,2021-10-28,000001,Vente,115000,37,,RUE DES PRETRES,0020,62360,62446,Hesdigneul-lès-Boulogne,62,,,62446000AC0180,,,,,,,,,,,,,0,3,Dépendance,,0,S,sols,,,17,1.670815,50.658443
2021-1054192,2021-10-29,000001,Vente terrain à bâtir,76000,,,CANTON DU BUISSON DE L ENF,B016,62360,62446,Hesdigneul-lès-Boulogne,62,,,62446000AH0200,,,,,,,,,,,,,0,,,,,AB,terrains a bâtir,,,725,1.660316,50.658744
2021-1054204,2021-10-25,000001,Vente,165500,57,,RUE DE LA GARE,0014,62360,62446,Hesdigneul-lès-Boulogne,62,,,62446000AC0011,,,,,,,,,,,,,0,1,Maison,156,5,S,sols,,,884,1.669943,50.660187
2021-1054204,2021-10-25,000001,Vente,165500,,,LE VILLAGE,B027,62360,62446,Hesdigneul-lès-Boulogne,62,,,62446000AC0012,,,,,,,,,,,,,0,,,,,J,jardins,,,1043,1.670266,50.660521
2021-1054279,2021-11-05,000001,Vente,205000,16,,RTE DE PONT DE BRIQUES,0019,62360,62446,Hesdigneul-lès-Boulogne,62,,,62446000AB0080,,,,,,,,,,,,,0,3,Dépendance,,0,S,sols,,,409,1.664977,50.659838
2021-1054279,2021-11-05,000001,Vente,205000,16,,RTE DE PONT DE BRIQUES,0019,62360,62446,Hesdigneul-lès-Boulogne,62,,,62446000AB0080,,,,,,,,,,,,,0,1,Maison,104,5,S,sols,,,409,1.664977,50.659838
2021-1054279,2021-11-05,000001,Vente,205000,,,CANTON LIBERT,B029,62360,62446,Hesdigneul-lès-Boulogne,62,,,62446000AB0194,,,,,,,,,,,,,0,,,,,S,sols,,,41,1.664895,50.65978
2021-1054279,2021-11-05,000001,Vente,205000,,,CANTON LIBERT,B029,62360,62446,Hesdigneul-lès-Boulogne,62,,,62446000AB0206,,,,,,,,,,,,,0,,,,,J,jardins,,,23,1.664875,50.659758
2021-1054363,2021-11-05,000001,Vente,145000,11,,RTE DE PONT DE BRIQUES,0019,62360,62446,Hesdigneul-lès-Boulogne,62,,,62446000AB0046,,,,,,,,,,,,,0,1,Maison,110,6,S,sols,,,144,1.666167,50.660109
2021-1054363,2021-11-05,000001,Vente,145000,,,PRES DU MARAIS,B026,62360,62446,Hesdigneul-lès-Boulogne,62,,,62446000AB0047,,,,,,,,,,,,,0,,,,,J,jardins,,,397,1.666253,50.660361
2021-1054831,2021-12-20,000001,Vente,205000,11,,RTE DE CONDETTE,0012,62360,62446,Hesdigneul-lès-Boulogne,62,,,62446000AC0140,,,,,,,,,,,,,0,1,Maison,139,5,S,sols,,,1613,1.674433,50.655648
2021-1054831,2021-12-20,000001,Vente,205000,11,,RTE DE CONDETTE,0012,62360,62446,Hesdigneul-lès-Boulogne,62,,,62446000AC0140,,,,,,,,,,,,,0,3,Dépendance,,0,S,sols,,,1613,1.674433,50.655648
2021-1054831,2021-12-20,000001,Vente,205000,11,,RTE DE CONDETTE,0012,62360,62446,Hesdigneul-lès-Boulogne,62,,,62446000AC0140,,,,,,,,,,,,,0,3,Dépendance,,0,S,sols,,,1613,1.674433,50.655648
2021-1054881,2021-12-20,000001,Vente,348000,33,,RES LA BOCAGERE,A008,62360,62446,Hesdigneul-lès-Boulogne,62,,,62446000AH0169,,,,,,,,,,,,,0,1,Maison,70,5,S,sols,,,603,1.669673,50.657395
2021-1054881,2021-12-20,000001,Vente,348000,,,CANTON DES TERRES PENDANTE,B015,62360,62446,Hesdigneul-lès-Boulogne,62,,,62446000AH0236,,,,,,,,,,,,,0,,,,,AB,terrains a bâtir,,,10,1.669869,50.657452
2021-1054899,2021-12-23,000001,Vente,5000,,,PRES DU MARAIS,B026,62360,62446,Hesdigneul-lès-Boulogne,62,,,62446000AB0222,,,,,,,,,,,,,0,,,,,S,sols,,,284,1.661985,50.660415
2021-1054900,2021-12-23,000001,Vente,60000,35,,RTE DE PONT DE BRIQUES,0019,62360,62446,Hesdigneul-lès-Boulogne,62,,,62446000AB0265,,,,,,,,,,,,,0,3,Dépendance,,0,S,sols,,,752,1.66174,50.660342
2021-1054900,2021-12-23,000001,Vente,60000,37,,RTE DE PONT DE BRIQUES,0019,62360,62446,Hesdigneul-lès-Boulogne,62,,,62446000AB0267,,,,,,,,,,,,,0,3,Dépendance,,0,S,sols,,,330,1.661508,50.660275
2021-1055015,2021-12-28,000001,Vente,226000,35,,RUE DE CARLY,0010,62360,62446,Hesdigneul-lès-Boulogne,62,,,62446000AD0214,,,,,,,,,,,,,0,1,Maison,88,4,S,sols,,,741,1.685075,50.655078
2021-1055040,2021-12-15,000001,Vente terrain à bâtir,76000,21,,RUE DES BUISSONS FLEURIS,0006,62360,62446,Hesdigneul-lès-Boulogne,62,,,62446000AH0198,,,,,,,,,,,,,0,,,,,AB,terrains a bâtir,,,684,1.660748,50.658529
2021-1055040,2021-12-15,000001,Vente terrain à bâtir,76000,,,CANTON DU BUISSON DE L ENF,B016,62360,62446,Hesdigneul-lès-Boulogne,62,,,62446000AH0227,,,,,,,,,,,,,0,,,,,AB,terrains a bâtir,,,38,1.66086,50.658503
2021-1055081,2021-12-15,000001,Vente,250000,7,,RES LA BOCAGERE,A008,62360,62446,Hesdigneul-lès-Boulogne,62,,,62446000AH0124,,,,,,,,,,,,,0,1,Maison,95,4,S,sols,,,274,1.667478,50.65791
2021-1055081,2021-12-15,000001,Vente,250000,,,RES LA BOCAGERE,A008,62360,62446,Hesdigneul-lès-Boulogne,62,,,62446000AH0142,,,,,,,,,,,,,0,,,,,AB,terrains a bâtir,,,100,1.66737,50.657898
2021-1055081,2021-12-15,000001,Vente,250000,,,RES LA BOCAGERE,A008,62360,62446,Hesdigneul-lès-Boulogne,62,,,62446000AH0155,,,,,,,,,,,,,0,,,,,AB,terrains a bâtir,,,144,1.667431,50.657817
