id_mutation,date_mutation,numero_disposition,nature_mutation,valeur_fonciere,adresse_numero,adresse_suffixe,adresse_nom_voie,adresse_code_voie,code_postal,code_commune,nom_commune,code_departement,ancien_code_commune,ancien_nom_commune,id_parcelle,ancien_id_parcelle,numero_volume,lot1_numero,lot1_surface_carrez,lot2_numero,lot2_surface_carrez,lot3_numero,lot3_surface_carrez,lot4_numero,lot4_surface_carrez,lot5_numero,lot5_surface_carrez,nombre_lots,code_type_local,type_local,surface_reelle_bati,nombre_pieces_principales,code_nature_culture,nature_culture,code_nature_culture_speciale,nature_culture_speciale,surface_terrain,longitude,latitude
2021-1033150,2021-02-19,000001,Vente,130000,24,,RUE PRINCIPALE,0100,62130,62462,Huclier,62,,,624620000A0487,,,,,,,,,,,,,0,1,Maison,180,6,S,sols,,,903,2.355649,50.430842
2021-1033150,2021-02-19,000001,Vente,130000,,,LE VILLAGE,B022,62130,62462,Huclier,62,,,624620000A0489,,,,,,,,,,,,,0,,,,,S,sols,,,212,2.355638,50.430672
2021-1033150,2021-02-19,000001,Vente,130000,,,LE VILLAGE,B022,62130,62462,Huclier,62,,,624620000A0610,,,,,,,,,,,,,0,,,,,P,prés,,,200,2.355343,50.430871
2021-1033150,2021-02-19,000001,Vente,130000,,,LE VILLAGE,B022,62130,62462,Huclier,62,,,624620000A0612,,,,,,,,,,,,,0,,,,,P,prés,,,60,2.355714,50.431094
2021-1033150,2021-02-19,000001,Vente,130000,,,LE VILLAGE,B022,62130,62462,Huclier,62,,,624620000A0662,,,,,,,,,,,,,0,,,,,S,sols,,,327,2.355762,50.430702
2021-1033150,2021-02-19,000001,Vente,130000,,,LE VILLAGE,B022,62130,62462,Huclier,62,,,624620000A0664,,,,,,,,,,,,,0,,,,,P,prés,,,1998,2.355908,50.431212
2021-1034980,2021-06-01,000001,Vente,135000,3,,RUE PRINCIPALE,0100,62130,62462,Huclier,62,,,624620000A0389,,,,,,,,,,,,,0,1,Maison,127,3,S,sols,,,422,2.356354,50.428877
2021-1034980,2021-06-01,000001,Vente,135000,,,LE VILLAGE,B022,62130,62462,Huclier,62,,,624620000A0390,,,,,,,,,,,,,0,,,,,S,sols,,,40,2.356478,50.429024
2021-1034980,2021-06-01,000001,Vente,135000,,,LE VILLAGE,B022,62130,62462,Huclier,62,,,624620000A0390,,,,,,,,,,,,,0,,,,,J,jardins,,,302,2.356478,50.429024
2021-1034980,2021-06-01,000001,Vente,135000,,,LE VILLAGE,B022,62130,62462,Huclier,62,,,624620000A0391,,,,,,,,,,,,,0,,,,,J,jardins,,,670,2.356111,50.428976
2021-1034980,2021-06-01,000001,Vente,135000,,,LE VILLAGE,B022,62130,62462,Huclier,62,,,624620000A0391,,,,,,,,,,,,,0,,,,,S,sols,,,20,2.356111,50.428976
2021-1035791,2021-07-01,000002,Echange,35000,,,LES DOUZE,B009,62130,62462,Huclier,62,,,62462000ZE0026,,,,,,,,,,,,,0,,,,,T,terres,,,3325,2.360994,50.439811
2021-1035791,2021-07-01,000002,Echange,35000,,,LES DOUZE,B009,62130,62462,Huclier,62,,,62462000ZE0026,,,,,,,,,,,,,0,,,,,T,terres,,,25204,2.360994,50.439811
2021-1036364,2021-08-12,000001,Vente,35000,,,LE VILLAGE,B022,62130,62462,Huclier,62,,,624620000A0392,,,,,,,,,,,,,0,,,,,P,prés,,,912,,
2021-1036364,2021-08-12,000001,Vente,35000,,,LE VILLAGE,B022,62130,62462,Huclier,62,,,624620000A0632,,,,,,,,,,,,,0,,,,,S,sols,,,617,,
2021-1036876,2021-08-12,000002,Vente,5000,,,LE VILLAGE,B022,62130,62462,Huclier,62,,,624620000A0682,,,,,,,,,,,,,0,,,,,P,prés,,,73,2.356118,50.428829
2021-1036876,2021-08-12,000002,Vente,5000,,,LE VILLAGE,B022,62130,62462,Huclier,62,,,624620000A0684,,,,,,,,,,,,,0,,,,,S,sols,,,2,2.355926,50.428988
