id_mutation,date_mutation,numero_disposition,nature_mutation,valeur_fonciere,adresse_numero,adresse_suffixe,adresse_nom_voie,adresse_code_voie,code_postal,code_commune,nom_commune,code_departement,ancien_code_commune,ancien_nom_commune,id_parcelle,ancien_id_parcelle,numero_volume,lot1_numero,lot1_surface_carrez,lot2_numero,lot2_surface_carrez,lot3_numero,lot3_surface_carrez,lot4_numero,lot4_surface_carrez,lot5_numero,lot5_surface_carrez,nombre_lots,code_type_local,type_local,surface_reelle_bati,nombre_pieces_principales,code_nature_culture,nature_culture,code_nature_culture_speciale,nature_culture_speciale,surface_terrain,longitude,latitude
2021-1055390,2021-01-26,000001,Vente,13000,,,LES SAUETTES,B066,62650,62466,Humbert,62,,,624660000C0145,,,,,,,,,,,,,0,,,,,L,landes,,,900,1.93157,50.493648
2021-1055390,2021-01-26,000001,Vente,13000,,,LES ONZE MESURES,B049,62650,62466,Humbert,62,,,62466000ZB0051,,,,,,,,,,,,,0,,,,,T,terres,,,21277,1.924935,50.497755
2021-1055663,2021-02-18,000001,Vente,150000,,,LE VILLAGE,B072,62650,62466,Humbert,62,,,624660000A0591,,,,,,,,,,,,,0,,,,,P,prés,,,1930,1.915884,50.509594
2021-1055663,2021-02-18,000001,Vente,150000,,,LE VILLAGE,B072,62650,62466,Humbert,62,,,624660000A0592,,,,,,,,,,,,,0,,,,,J,jardins,,,850,1.916375,50.508997
2021-1055663,2021-02-18,000001,Vente,150000,39,,RUE PRINCIPALE,0041,62650,62466,Humbert,62,,,624660000A0593,,,,,,,,,,,,,0,1,Maison,117,3,S,sols,,,515,1.916556,50.508844
2021-1055702,2021-02-09,000001,Vente,13500,,,LA COTE WATEL,B028,62650,62466,Humbert,62,,,624660000A0672,,,,,,,,,,,,,0,,,,,L,landes,,,680,1.918633,50.506883
2021-1055702,2021-02-09,000001,Vente,13500,,,LA COTE WATEL,B028,62650,62466,Humbert,62,,,624660000A0673,,,,,,,,,,,,,0,,,,,L,landes,,,770,1.917743,50.506476
2021-1055702,2021-02-09,000001,Vente,13500,,,LE FEUTEL,B036,62650,62466,Humbert,62,,,624660000A0772,,,,,,,,,,,,,0,,,,,BT,taillis simples,,,6570,1.91856,50.506618
2021-1055702,2021-02-09,000001,Vente,13500,,,LE FEUTEL,B036,62650,62466,Humbert,62,,,624660000A0773,,,,,,,,,,,,,0,,,,,BT,taillis simples,,,1560,1.919439,50.507006
2021-1055702,2021-02-09,000001,Vente,13500,,,LA COTE WATEL,B028,62650,62466,Humbert,62,,,624660000A0774,,,,,,,,,,,,,0,,,,,BT,taillis simples,,,1040,1.919758,50.507032
2021-1055705,2021-02-09,000001,Vente,8000,,,LA COTE WATEL,B028,62650,62466,Humbert,62,,,624660000A0674,,,,,,,,,,,,,0,,,,,P,prés,,,2040,1.917396,50.506999
2021-1055705,2021-02-09,000001,Vente,8000,,,LA COTE WATEL,B028,62650,62466,Humbert,62,,,624660000A0674,,,,,,,,,,,,,0,,,,,P,prés,,,2040,1.917396,50.506999
2021-1055705,2021-02-09,000001,Vente,8000,,,LA COTE WATEL,B028,62650,62466,Humbert,62,,,624660000A0823,,,,,,,,,,,,,0,,,,,P,prés,,,3382,1.918657,50.507179
2021-1055705,2021-02-09,000001,Vente,8000,,,LA COTE WATEL,B028,62650,62466,Humbert,62,,,624660000A0823,,,,,,,,,,,,,0,,,,,P,prés,,,3381,1.918657,50.507179
2021-1056188,2021-04-13,000001,Vente,2898,,,LES CROQUETS,B033,62650,62466,Humbert,62,,,62466000ZB0066,,,,,,,,,,,,,0,,,,,P,prés,,,4739,1.915454,50.501844
2021-1056188,2021-04-13,000001,Vente,2898,,,LE PETIT COUTRE,B054,62650,62466,Humbert,62,,,62466000ZH0033,,,,,,,,,,,,,0,,,,,T,terres,,,1701,1.900219,50.491858
2021-1056533,2021-04-26,000001,Vente,85000,,,LE VILLAGE,B072,62650,62466,Humbert,62,,,624660000A0604,,,,,,,,,,,,,0,,,,,S,sols,,,353,1.911482,50.507748
2021-1056533,2021-04-26,000001,Vente,85000,,,LE VILLAGE,B072,62650,62466,Humbert,62,,,624660000A0604,,,,,,,,,,,,,0,,,,,P,prés,,,2547,1.911482,50.507748
2021-1056533,2021-04-26,000001,Vente,85000,,,LE VILLAGE,B072,62650,62466,Humbert,62,,,624660000A0605,,,,,,,,,,,,,0,,,,,J,jardins,,,1247,1.911879,50.507498
2021-1056533,2021-04-26,000001,Vente,85000,,,LE VILLAGE,B072,62650,62466,Humbert,62,,,624660000A0605,,,,,,,,,,,,,0,,,,,S,sols,,,93,1.911879,50.507498
2021-1056533,2021-04-26,000001,Vente,85000,25,,RUE PRINCIPALE,0041,62650,62466,Humbert,62,,,624660000A0606,,,,,,,,,,,,,0,1,Maison,68,4,S,sols,,,580,1.911812,50.507432
2021-1057527,2021-07-23,000001,Vente,255968,,,LES TANNIERES,B074,62650,62466,Humbert,62,,,62466000ZD0032,,,,,,,,,,,,,0,,,,,T,terres,,,2328,1.901037,50.484794
2021-1057702,2021-07-22,000001,Vente,65000,7,,RUE DE ST DENOEUX - HAM POTIER,0055,62650,62466,Humbert,62,,,624660000C0203,,,,,,,,,,,,,0,1,Maison,54,2,S,sols,,,620,1.926968,50.490402
2021-1057702,2021-07-22,000001,Vente,65000,7,,RUE DE ST DENOEUX - HAM POTIER,0055,62650,62466,Humbert,62,,,624660000C0203,,,,,,,,,,,,,0,1,Maison,54,2,J,jardins,,,970,1.926968,50.490402
2021-1057702,2021-07-22,000001,Vente,65000,7,,RUE DE ST DENOEUX - HAM POTIER,0055,62650,62466,Humbert,62,,,624660000C0203,,,,,,,,,,,,,0,1,Maison,54,2,P,prés,,,1880,1.926968,50.490402
2021-1057825,2021-08-10,000001,Vente,20000,,,LE VILLAGE,B072,62650,62466,Humbert,62,,,624660000A0946,,,,,,,,,,,,,0,,,,,P,prés,,,1681,1.901625,50.501691
2021-1057909,2021-09-06,000001,Vente,100000,5,,RUE DE ST DENOEUX - HAM POTIER,0055,62650,62466,Humbert,62,,,624660000C0218,,,,,,,,,,,,,0,1,Maison,133,5,S,sols,,,5098,1.927265,50.492242
2021-1058923,2021-11-05,000001,Vente,168690.6,,,LA VALLEE D HENOVAL,B069,62650,62466,Humbert,62,,,62466000ZK0054,,,,,,,,,,,,,0,,,,,T,terres,,,7444,1.903267,50.51765
2021-1058923,2021-11-05,000001,Vente,168690.6,,,LA VALLEE D HENOVAL,B069,62650,62466,Humbert,62,,,62466000ZK0054,,,,,,,,,,,,,0,,,,,T,terres,,,7445,1.903267,50.51765
2021-1059281,2021-12-03,000001,Vente,32000,,,LE VILLAGE,B072,62650,62466,Humbert,62,,,624660000A0960,,,,,,,,,,,,,0,,,,,AB,terrains a bâtir,,,1467,1.911954,50.506452
