id_mutation,date_mutation,numero_disposition,nature_mutation,valeur_fonciere,adresse_numero,adresse_suffixe,adresse_nom_voie,adresse_code_voie,code_postal,code_commune,nom_commune,code_departement,ancien_code_commune,ancien_nom_commune,id_parcelle,ancien_id_parcelle,numero_volume,lot1_numero,lot1_surface_carrez,lot2_numero,lot2_surface_carrez,lot3_numero,lot3_surface_carrez,lot4_numero,lot4_surface_carrez,lot5_numero,lot5_surface_carrez,nombre_lots,code_type_local,type_local,surface_reelle_bati,nombre_pieces_principales,code_nature_culture,nature_culture,code_nature_culture_speciale,nature_culture_speciale,surface_terrain,longitude,latitude
2021-1033202,2021-02-12,000001,Vente,975,,,LES CROISETTES,B011,62760,62583,Mondicourt,62,,,625830000C0198,,,,,,,,,,,,,0,,,,,T,terres,,,975,2.459192,50.162351
2021-1034101,2021-04-13,000001,Vente,10818.6,,,LE CHEMIN D HURTEBISE,B006,62760,62583,Mondicourt,62,,,625830000C0214,,,,,,,,,,,,,0,,,,,T,terres,,,1440,2.459134,50.165659
2021-1034101,2021-04-13,000001,Vente,10818.6,,,LE CHEMIN D HURTEBISE,B006,62760,62583,Mondicourt,62,,,625830000C0215,,,,,,,,,,,,,0,,,,,T,terres,,,1305,2.459026,50.165403
2021-1034101,2021-04-13,000001,Vente,10818.6,,,LE CHEMIN D HURTEBISE,B006,62760,62583,Mondicourt,62,,,625830000C0216,,,,,,,,,,,,,0,,,,,T,terres,,,155,2.459378,50.165165
2021-1034107,2021-04-06,000001,Vente,65920,,,LES CORTILLIERS,B010,62760,62583,Mondicourt,62,,,625830000B0477,,,,,,,,,,,,,0,,,,,L,landes,,,672,2.466782,50.172275
2021-1034107,2021-04-06,000001,Vente,65920,,,LES CORTILLIERS,B010,62760,62583,Mondicourt,62,,,625830000B0480,,,,,,,,,,,,,0,,,,,L,landes,,,588,2.466953,50.172729
2021-1034107,2021-04-06,000001,Vente,65920,,,LES CORTILLIERS,B010,62760,62583,Mondicourt,62,,,625830000B0481,,,,,,,,,,,,,0,,,,,L,landes,,,800,2.467215,50.172694
2021-1034490,2021-05-07,000001,Vente,30000,,,LES DIX SEPT,B017,62760,62583,Mondicourt,62,,,625830000C0312,,,,,,,,,,,,,0,,,,,P,prés,,,5190,2.458206,50.177257
2021-1034494,2021-05-07,000001,Vente,110000,1,,RTE NATIONALE,0260,62760,62583,Mondicourt,62,,,625830000C0313,,,,,,,,,,,,,0,1,Maison,76,3,S,sols,,,965,2.457715,50.177241
2021-1034494,2021-05-07,000001,Vente,110000,1,,RTE NATIONALE,0260,62760,62583,Mondicourt,62,,,625830000C0313,,,,,,,,,,,,,0,3,Dépendance,,0,S,sols,,,965,2.457715,50.177241
2021-1034494,2021-05-07,000001,Vente,110000,1,,RTE NATIONALE,0260,62760,62583,Mondicourt,62,,,625830000C0313,,,,,,,,,,,,,0,1,Maison,120,5,S,sols,,,965,2.457715,50.177241
2021-1034494,2021-05-07,000001,Vente,110000,,,LES DIX SEPT,B017,62760,62583,Mondicourt,62,,,625830000C0314,,,,,,,,,,,,,0,,,,,S,sols,,,140,2.457684,50.177144
2021-1035507,2021-07-06,000001,Vente,130000,9,,CHE DE GRINCOURT,0143,62760,62583,Mondicourt,62,,,625830000B0114,,,,,,,,,,,,,0,3,Dépendance,,0,S,sols,,,72,2.469987,50.168879
2021-1035507,2021-07-06,000001,Vente,130000,9,,CHE DE GRINCOURT,0143,62760,62583,Mondicourt,62,,,625830000B0114,,,,,,,,,,,,,0,1,Maison,119,6,S,sols,,,72,2.469987,50.168879
2021-1035507,2021-07-06,000001,Vente,130000,9,,CHE DE GRINCOURT,0143,62760,62583,Mondicourt,62,,,625830000B0114,,,,,,,,,,,,,0,1,Maison,119,6,T,terres,,,1993,2.469987,50.168879
2021-1035507,2021-07-06,000001,Vente,130000,9,,CHE DE GRINCOURT,0143,62760,62583,Mondicourt,62,,,625830000B0114,,,,,,,,,,,,,0,3,Dépendance,,0,T,terres,,,1993,2.469987,50.168879
2021-1037844,2021-10-25,000001,Vente,155000,36,,RUE DE LA GARE,0020,62760,62583,Mondicourt,62,,,625830000C1035,,,,,,,,,,,,,0,1,Maison,90,4,S,sols,,,247,2.458657,50.175578
2021-1038246,2021-11-18,000001,Vente,50200,15,B,RUE DE LA GARE,0020,62760,62583,Mondicourt,62,,,625830000C1102,,,,,,,,,,,,,0,1,Maison,80,3,S,sols,,,127,2.460806,50.173607
2021-1038349,2021-12-04,000001,Vente,136500,10,,RUE DE LA MAIRIE,0240,62760,62583,Mondicourt,62,,,625830000C0415,,,,,,,,,,,,,0,3,Dépendance,,0,S,sols,,,680,2.460809,50.174283
2021-1038349,2021-12-04,000001,Vente,136500,10,,RUE DE LA MAIRIE,0240,62760,62583,Mondicourt,62,,,625830000C0415,,,,,,,,,,,,,0,1,Maison,133,5,S,sols,,,680,2.460809,50.174283
2021-1038494,2021-12-06,000001,Vente,2000,,,LES DIX SEPT,B017,62760,62583,Mondicourt,62,,,625830000C1100,,,,,,,,,,,,,0,,,,,T,terres,,,550,2.458319,50.177096
2021-1038626,2021-12-10,000002,Vente,265128,,,BOUT DE LA VILLE,B003,62760,62583,Mondicourt,62,,,625830000B0401,,,,,,,,,,,,,0,,,,,AG,terrains d'agrément,,,313,2.467291,50.174082
2021-1038626,2021-12-10,000002,Vente,265128,,,BOUT DE LA VILLE,B003,62760,62583,Mondicourt,62,,,625830000B0446,,,,,,,,,,,,,0,,,,,P,prés,,,14034,2.468307,50.173561
2021-1038626,2021-12-10,000002,Vente,265128,,,BOUT DE LA VILLE,B003,62760,62583,Mondicourt,62,,,625830000B0491,,,,,,,,,,,,,0,,,,,AG,terrains d'agrément,,,1359,2.46842,50.173025
2021-1038626,2021-12-10,000002,Vente,265128,,,BOUT DE LA VILLE,B003,62760,62583,Mondicourt,62,,,625830000B0492,,,,,,,,,,,,,0,,,,,AG,terrains d'agrément,,,77,2.467473,50.173997
