id_mutation,date_mutation,numero_disposition,nature_mutation,valeur_fonciere,adresse_numero,adresse_suffixe,adresse_nom_voie,adresse_code_voie,code_postal,code_commune,nom_commune,code_departement,ancien_code_commune,ancien_nom_commune,id_parcelle,ancien_id_parcelle,numero_volume,lot1_numero,lot1_surface_carrez,lot2_numero,lot2_surface_carrez,lot3_numero,lot3_surface_carrez,lot4_numero,lot4_surface_carrez,lot5_numero,lot5_surface_carrez,nombre_lots,code_type_local,type_local,surface_reelle_bati,nombre_pieces_principales,code_nature_culture,nature_culture,code_nature_culture_speciale,nature_culture_speciale,surface_terrain,longitude,latitude
2021-1055515,2021-01-20,000001,Vente,24500,,,LES CINQUANTE,B007,62310,62726,Ruisseauville,62,,,627260000B0335,,,,,,,,,,,,,0,,,,,AB,terrains a bâtir,,,1240,2.131122,50.48165
2021-1055796,2021-02-23,000001,Vente,176500,49,,RTE DE CANLERS,0050,62310,62726,Ruisseauville,62,,,627260000B0337,,,,,,,,,,,,,0,1,Maison,90,4,S,sols,,,1000,2.131735,50.481693
2021-1055796,2021-02-23,000001,Vente,176500,49,,RTE DE CANLERS,0050,62310,62726,Ruisseauville,62,,,627260000B0337,,,,,,,,,,,,,0,1,Maison,90,4,J,jardins,,,321,2.131735,50.481693
2021-1056582,2021-04-30,000001,Vente,144165,,,LES QUATRE VINGTS,B010,62310,62726,Ruisseauville,62,,,627260000B0158,,,,,,,,,,,,,0,,,,,T,terres,,,63390,2.132708,50.479186
2021-1056582,2021-04-30,000001,Vente,144165,,,LES QUATRE VINGTS,B010,62310,62726,Ruisseauville,62,,,627260000B0315,,,,,,,,,,,,,0,,,,,T,terres,,,116817,2.134134,50.477265
2021-1057043,2021-06-24,000001,Vente,4537.4,,,LE VILLAGE,B012,62310,62726,Ruisseauville,62,,,627260000B0390,,,,,,,,,,,,,0,,,,,P,prés,,,6482,2.127002,50.47986
2021-1057044,2021-06-24,000002,Vente,35000,,,LE VILLAGE,B012,62310,62726,Ruisseauville,62,,,627260000B0389,,,,,,,,,,,,,0,,,,,P,prés,,,1410,2.126545,50.479252
2021-1057820,2021-08-10,000002,Vente,3000,13,,RTE DE CANLERS,0050,62310,62726,Ruisseauville,62,,,627260000B0387,,,,,,,,,,,,,0,3,Dépendance,,0,S,sols,,,92,2.127012,50.48142
2021-1057820,2021-08-10,000002,Vente,3000,13,,RTE DE CANLERS,0050,62310,62726,Ruisseauville,62,,,627260000B0387,,,,,,,,,,,,,0,1,Maison,110,5,S,sols,,,92,2.127012,50.48142
