id_mutation,date_mutation,numero_disposition,nature_mutation,valeur_fonciere,adresse_numero,adresse_suffixe,adresse_nom_voie,adresse_code_voie,code_postal,code_commune,nom_commune,code_departement,ancien_code_commune,ancien_nom_commune,id_parcelle,ancien_id_parcelle,numero_volume,lot1_numero,lot1_surface_carrez,lot2_numero,lot2_surface_carrez,lot3_numero,lot3_surface_carrez,lot4_numero,lot4_surface_carrez,lot5_numero,lot5_surface_carrez,nombre_lots,code_type_local,type_local,surface_reelle_bati,nombre_pieces_principales,code_nature_culture,nature_culture,code_nature_culture_speciale,nature_culture_speciale,surface_terrain,longitude,latitude
2021-1071380,2021-08-02,000001,Vente,465000,,,LES GRANDES PRADES,B083,63310,63333,Saint-Denis-Combarnazat,63,,,63333000ZE0010,,,,,,,,,,,,,0,,,,,T,terres,,,97090,3.338849,45.97758
2021-1071380,2021-08-02,000001,Vente,465000,,,LES PRADES,B128,63310,63333,Saint-Denis-Combarnazat,63,,,63333000ZE0063,,,,,,,,,,,,,0,,,,,T,terres,,,68560,3.341387,45.975345
2021-1071380,2021-08-02,000001,Vente,465000,9001,,CHE DES BORIES,0004,63310,63333,Saint-Denis-Combarnazat,63,,,63333000ZM0023,,,,,,,,,,,,,0,1,Maison,76,4,P,prés,,,14190,3.342264,45.972258
2021-1071380,2021-08-02,000001,Vente,465000,9001,,CHE DES BORIES,0004,63310,63333,Saint-Denis-Combarnazat,63,,,63333000ZM0023,,,,,,,,,,,,,0,1,Maison,88,3,P,prés,,,14190,3.342264,45.972258
2021-1071380,2021-08-02,000001,Vente,465000,9001,,CHE DES BORIES,0004,63310,63333,Saint-Denis-Combarnazat,63,,,63333000ZM0023,,,,,,,,,,,,,0,1,Maison,88,3,P,prés,,,2015,3.342264,45.972258
2021-1071380,2021-08-02,000001,Vente,465000,9001,,CHE DES BORIES,0004,63310,63333,Saint-Denis-Combarnazat,63,,,63333000ZM0023,,,,,,,,,,,,,0,1,Maison,76,4,S,sols,,,5745,3.342264,45.972258
2021-1071380,2021-08-02,000001,Vente,465000,9001,,CHE DES BORIES,0004,63310,63333,Saint-Denis-Combarnazat,63,,,63333000ZM0023,,,,,,,,,,,,,0,1,Maison,88,3,S,sols,,,5745,3.342264,45.972258
2021-1071380,2021-08-02,000001,Vente,465000,9001,,CHE DES BORIES,0004,63310,63333,Saint-Denis-Combarnazat,63,,,63333000ZM0023,,,,,,,,,,,,,0,1,Maison,76,4,T,terres,,,112800,3.342264,45.972258
2021-1071380,2021-08-02,000001,Vente,465000,9001,,CHE DES BORIES,0004,63310,63333,Saint-Denis-Combarnazat,63,,,63333000ZM0023,,,,,,,,,,,,,0,1,Maison,88,3,T,terres,,,112800,3.342264,45.972258
2021-1071380,2021-08-02,000001,Vente,465000,9001,,CHE DES BORIES,0004,63310,63333,Saint-Denis-Combarnazat,63,,,63333000ZM0023,,,,,,,,,,,,,0,1,Maison,76,4,P,prés,,,2015,3.342264,45.972258
2021-1071380,2021-08-02,000001,Vente,465000,,,LE GRAND CHAMP DES BORIES,B079,63310,63333,Saint-Denis-Combarnazat,63,,,63333000ZM0024,,,,,,,,,,,,,0,,,,,T,terres,,,9320,3.339922,45.970639
2021-1071944,2021-08-06,000001,Vente,118600,9003,,RUE DU CHAMP PAGNANT,0014,63310,63333,Saint-Denis-Combarnazat,63,,,633330000C1555,,,,,,,,,,,,,0,3,Dépendance,,0,S,sols,,,745,3.332529,45.963497
2021-1071944,2021-08-06,000001,Vente,118600,9003,,RUE DU CHAMP PAGNANT,0014,63310,63333,Saint-Denis-Combarnazat,63,,,633330000C1555,,,,,,,,,,,,,0,1,Maison,48,3,S,sols,,,745,3.332529,45.963497
2021-1073738,2021-09-13,000001,Vente,27637.5,,,CHAMP PAGNANT,B042,63310,63333,Saint-Denis-Combarnazat,63,,,63333000ZL0182,,,,,,,,,,,,,0,,,,,AB,terrains a bâtir,,,1005,3.332674,45.962924
2021-1074360,2021-10-05,000001,Vente,142930,9002,,RUE DE L EGLISE,0022,63310,63333,Saint-Denis-Combarnazat,63,,,63333000ZL0149,,,,,,,,,,,,,0,1,Maison,79,4,S,sols,,,1000,3.33696,45.962861
2021-1074836,2021-10-11,000001,Vente,140000,9006,,RUE DU PATURAL,0050,63310,63333,Saint-Denis-Combarnazat,63,,,63333000ZH0144,,,,,,,,,,,,,0,1,Maison,91,5,S,sols,,,755,3.355022,45.985233
2021-1074836,2021-10-11,000001,Vente,140000,9006,,RUE DU PATURAL,0050,63310,63333,Saint-Denis-Combarnazat,63,,,63333000ZH0144,,,,,,,,,,,,,0,1,Maison,91,5,T,terres,,,1935,3.355022,45.985233
2021-1076822,2021-11-04,000001,Vente,61792.5,,,CHAMP PAGNANT,B042,63310,63333,Saint-Denis-Combarnazat,63,,,63333000ZL0184,,,,,,,,,,,,,0,,,,,AB,terrains a bâtir,,,1185,3.332933,45.963432
2021-1076822,2021-11-04,000001,Vente,61792.5,,,CHAMP PAGNANT,B042,63310,63333,Saint-Denis-Combarnazat,63,,,63333000ZL0185,,,,,,,,,,,,,0,,,,,AB,terrains a bâtir,,,1062,3.333506,45.963505
2021-1079839,2021-01-04,000001,Vente,397600,9003,,RTE DE LA VIALLE,0065,63310,63333,Saint-Denis-Combarnazat,63,,,633330000C0160,,,,,,,,,,,,,0,3,Dépendance,,0,AG,terrains d'agrément,,,1600,3.335258,45.968328
2021-1079839,2021-01-04,000001,Vente,397600,9003,,RTE DE LA VIALLE,0065,63310,63333,Saint-Denis-Combarnazat,63,,,633330000C0160,,,,,,,,,,,,,0,3,Dépendance,,0,AG,terrains d'agrément,,,1600,3.335258,45.968328
2021-1079839,2021-01-04,000001,Vente,397600,9003,,RTE DE LA VIALLE,0065,63310,63333,Saint-Denis-Combarnazat,63,,,633330000C0160,,,,,,,,,,,,,0,1,Maison,290,5,AG,terrains d'agrément,,,1600,3.335258,45.968328
2021-1079839,2021-01-04,000001,Vente,397600,9003,,RTE DE LA VIALLE,0065,63310,63333,Saint-Denis-Combarnazat,63,,,633330000C0160,,,,,,,,,,,,,0,3,Dépendance,,0,S,sols,,,500,3.335258,45.968328
2021-1079839,2021-01-04,000001,Vente,397600,9003,,RTE DE LA VIALLE,0065,63310,63333,Saint-Denis-Combarnazat,63,,,633330000C0160,,,,,,,,,,,,,0,3,Dépendance,,0,S,sols,,,500,3.335258,45.968328
2021-1079839,2021-01-04,000001,Vente,397600,9003,,RTE DE LA VIALLE,0065,63310,63333,Saint-Denis-Combarnazat,63,,,633330000C0160,,,,,,,,,,,,,0,1,Maison,290,5,S,sols,,,500,3.335258,45.968328
2021-1079839,2021-01-04,000001,Vente,397600,,,AU BOURG,B145,63310,63333,Saint-Denis-Combarnazat,63,,,633330000C0161,,,,,,,,,,,,,0,,,,,AG,terrains d'agrément,,,485,3.335842,45.968428
2021-1079839,2021-01-04,000001,Vente,397600,,,AU BOURG,B145,63310,63333,Saint-Denis-Combarnazat,63,,,633330000C0162,,,,,,,,,,,,,0,,,,,P,prés,,,7655,3.335309,45.968669
