id_mutation,date_mutation,numero_disposition,nature_mutation,valeur_fonciere,adresse_numero,adresse_suffixe,adresse_nom_voie,adresse_code_voie,code_postal,code_commune,nom_commune,code_departement,ancien_code_commune,ancien_nom_commune,id_parcelle,ancien_id_parcelle,numero_volume,lot1_numero,lot1_surface_carrez,lot2_numero,lot2_surface_carrez,lot3_numero,lot3_surface_carrez,lot4_numero,lot4_surface_carrez,lot5_numero,lot5_surface_carrez,nombre_lots,code_type_local,type_local,surface_reelle_bati,nombre_pieces_principales,code_nature_culture,nature_culture,code_nature_culture_speciale,nature_culture_speciale,surface_terrain,longitude,latitude
2021-1067171,2021-05-29,000001,Vente,9880,,,LES FAVINS,B054,63580,63340,Saint-Étienne-sur-Usson,63,,,63340000ZN0014,,,,,,,,,,,,,0,,,,,T,terres,,,760,3.381088,45.492794
2021-1067983,2021-06-16,000001,Vente,195000,5568,A,TIGOULIN SUD,B139,63580,63340,Saint-Étienne-sur-Usson,63,,,63340000ZO0067,,,,,,,,,,,,,0,3,Dépendance,,0,S,sols,,,375,3.38634,45.495352
2021-1067983,2021-06-16,000001,Vente,195000,5568,,TIGOULIN SUD,B139,63580,63340,Saint-Étienne-sur-Usson,63,,,63340000ZO0107,,,,,,,,,,,,,0,3,Dépendance,,0,S,sols,,,1800,3.38608,45.495793
2021-1067983,2021-06-16,000001,Vente,195000,5568,,TIGOULIN SUD,B139,63580,63340,Saint-Étienne-sur-Usson,63,,,63340000ZO0107,,,,,,,,,,,,,0,1,Maison,180,5,S,sols,,,1800,3.38608,45.495793
2021-1067983,2021-06-16,000001,Vente,195000,5568,,TIGOULIN SUD,B139,63580,63340,Saint-Étienne-sur-Usson,63,,,63340000ZO0107,,,,,,,,,,,,,0,3,Dépendance,,0,S,sols,,,1800,3.38608,45.495793
2021-1067983,2021-06-16,000001,Vente,195000,5568,,TIGOULIN SUD,B139,63580,63340,Saint-Étienne-sur-Usson,63,,,63340000ZO0107,,,,,,,,,,,,,0,3,Dépendance,,0,PA,pâtures,,,1032,3.38608,45.495793
2021-1067983,2021-06-16,000001,Vente,195000,5568,,TIGOULIN SUD,B139,63580,63340,Saint-Étienne-sur-Usson,63,,,63340000ZO0107,,,,,,,,,,,,,0,1,Maison,180,5,PA,pâtures,,,1032,3.38608,45.495793
2021-1067983,2021-06-16,000001,Vente,195000,5568,,TIGOULIN SUD,B139,63580,63340,Saint-Étienne-sur-Usson,63,,,63340000ZO0107,,,,,,,,,,,,,0,3,Dépendance,,0,PA,pâtures,,,1032,3.38608,45.495793
2021-1067983,2021-06-16,000001,Vente,195000,,,TIGOULIN SUD,B139,63580,63340,Saint-Étienne-sur-Usson,63,,,63340000ZO0109,,,,,,,,,,,,,0,,,,,S,sols,,,59,3.386313,45.495964
2021-1071084,2021-07-22,000001,Vente,23800,,,LA FONT DE BELLE,B058,63580,63340,Saint-Étienne-sur-Usson,63,,,63340000ZE0115,,,,,,,,,,,,,0,,,,,P,prés,,,3750,3.395837,45.524142
2021-1071084,2021-07-22,000001,Vente,23800,,,LA FONT DE BELLE,B058,63580,63340,Saint-Étienne-sur-Usson,63,,,63340000ZE0115,,,,,,,,,,,,,0,,,,,P,prés,,,3750,3.395837,45.524142
2021-1071084,2021-07-22,000001,Vente,23800,,,LA FONT DE BELLE,B058,63580,63340,Saint-Étienne-sur-Usson,63,,,63340000ZE0116,,,,,,,,,,,,,0,,,,,P,prés,,,3160,3.395179,45.524201
2021-1071084,2021-07-22,000001,Vente,23800,,,LA FONT DE BELLE,B058,63580,63340,Saint-Étienne-sur-Usson,63,,,63340000ZE0116,,,,,,,,,,,,,0,,,,,PA,pâtures,,,3160,3.395179,45.524201
2021-1071084,2021-07-22,000001,Vente,23800,,,LA FONT DE BELLE,B058,63580,63340,Saint-Étienne-sur-Usson,63,,,63340000ZE0116,,,,,,,,,,,,,0,,,,,P,prés,,,1700,3.395179,45.524201
2021-1071690,2021-08-12,000001,Vente,35000,,,CHABREYRAS,B027,63580,63340,Saint-Étienne-sur-Usson,63,,,63340000ZE0020,,,,,,,,,,,,,0,,,,,T,terres,,,3430,3.398667,45.527166
2021-1073502,2021-09-23,000001,Vente,1600,,,LES SUQUETS DE CHABREYRAS,B138,63580,63340,Saint-Étienne-sur-Usson,63,,,63340000ZE0052,,,,,,,,,,,,,0,,,,,T,terres,,,5550,3.401516,45.526865
2021-1073691,2021-09-24,000001,Vente,109800,5211,,CHAUVAYE,B037,63580,63340,Saint-Étienne-sur-Usson,63,,,63340000ZN0358,,,,,,,,,,,,,0,1,Maison,103,4,S,sols,,,241,3.382675,45.490877
2021-1073723,2021-10-02,000001,Vente,2500,,,LES FAVINS,B054,63580,63340,Saint-Étienne-sur-Usson,63,,,63340000ZN0013,,,,,,,,,,,,,0,,,,,T,terres,,,900,3.381113,45.492956
2021-1075000,2021-10-12,000001,Vente,3200,,,LES FENADES,B055,63580,63340,Saint-Étienne-sur-Usson,63,,,63340000ZN0202,,,,,,,,,,,,,0,,,,,L,landes,,,980,3.393524,45.489094
2021-1075002,2021-10-12,000001,Vente,110,,,POUCHON,B112,63580,63340,Saint-Étienne-sur-Usson,63,,,63340000ZM0097,,,,,,,,,,,,,0,,,,,P,prés,,,735,3.393639,45.49667
2021-1077519,2021-11-26,000001,Vente,1200,,,ROMAGNAT,B121,63580,63340,Saint-Étienne-sur-Usson,63,,,63340000ZN0311,,,,,,,,,,,,,0,,,,,T,terres,,,5624,3.37584,45.487684
2021-1077520,2021-11-26,000001,Vente,500,,,PRADOUX,B113,63580,63340,Saint-Étienne-sur-Usson,63,,,63340000ZN0124,,,,,,,,,,,,,0,,,,,BR,futaies résineuses,,,1275,3.37792,45.492604
2021-1077613,2021-12-01,000001,Vente,75000,,,CHABREYRAS,B027,63580,63340,Saint-Étienne-sur-Usson,63,,,63340000ZE0271,,,,,,,,,,,,,0,,,,,J,jardins,,,172,3.397729,45.526339
2021-1077613,2021-12-01,000001,Vente,75000,5095,,CHABREYRAS,B027,63580,63340,Saint-Étienne-sur-Usson,63,,,63340000ZE0273,,,,,,,,,,,,,0,1,Maison,49,3,S,sols,,,452,3.397905,45.52625
2021-1077613,2021-12-01,000001,Vente,75000,5095,,CHABREYRAS,B027,63580,63340,Saint-Étienne-sur-Usson,63,,,63340000ZE0273,,,,,,,,,,,,,0,3,Dépendance,,0,S,sols,,,452,3.397905,45.52625
2021-1077613,2021-12-01,000001,Vente,75000,,,CHABREYRAS,B027,63580,63340,Saint-Étienne-sur-Usson,63,,,63340000ZE0274,,,,,,,,,,,,,0,,,,,J,jardins,,,207,3.397781,45.526127
2021-1077626,2021-12-01,000001,Vente,12900,,,POUCHON,B112,63580,63340,Saint-Étienne-sur-Usson,63,,,63340000ZM0098,,,,,,,,,,,,,0,,,,,P,prés,,,4770,3.393438,45.497255
2021-1077626,2021-12-01,000001,Vente,12900,,,LES FENADES,B055,63580,63340,Saint-Étienne-sur-Usson,63,,,63340000ZN0207,,,,,,,,,,,,,0,,,,,L,landes,,,1250,3.392719,45.490574
2021-1077626,2021-12-01,000001,Vente,12900,,,FONT LONGE,B059,63580,63340,Saint-Étienne-sur-Usson,63,,,63340000ZO0053,,,,,,,,,,,,,0,,,,,PA,pâtures,,,23020,3.382019,45.498425
2021-1077626,2021-12-01,000001,Vente,12900,,,FONT LONGE,B059,63580,63340,Saint-Étienne-sur-Usson,63,,,63340000ZO0053,,,,,,,,,,,,,0,,,,,PA,pâtures,,,7310,3.382019,45.498425
2021-1077626,2021-12-01,000001,Vente,12900,,,FONT LONGE,B059,63580,63340,Saint-Étienne-sur-Usson,63,,,63340000ZO0053,,,,,,,,,,,,,0,,,,,BR,futaies résineuses,,,9800,3.382019,45.498425
2021-1077626,2021-12-01,000001,Vente,12900,,,FONT LONGE,B059,63580,63340,Saint-Étienne-sur-Usson,63,,,63340000ZO0055,,,,,,,,,,,,,0,,,,,BR,futaies résineuses,,,7265,3.3827,45.497224
2021-1077626,2021-12-01,000001,Vente,12900,,,FONT LONGE,B059,63580,63340,Saint-Étienne-sur-Usson,63,,,63340000ZO0055,,,,,,,,,,,,,0,,,,,PA,pâtures,,,19430,3.3827,45.497224
2021-1077626,2021-12-01,000001,Vente,12900,,,BOIS REDON,B017,63580,63340,Saint-Étienne-sur-Usson,63,,,63340000ZO0089,,,,,,,,,,,,,0,,,,,P,prés,,,5370,3.392581,45.49768
2021-1077626,2021-12-01,000001,Vente,12900,,,BOIS DE CHENES,B014,63580,63340,Saint-Étienne-sur-Usson,63,,,63340000ZO0095,,,,,,,,,,,,,0,,,,,BT,taillis simples,,,3795,3.392795,45.493274
2021-1077626,2021-12-01,000001,Vente,12900,,,BOIS DES COTES,B015,63580,63340,Saint-Étienne-sur-Usson,63,,,63340000ZP0033,,,,,,,,,,,,,0,,,,,BR,futaies résineuses,,,585,3.375703,45.500885
2021-1077626,2021-12-01,000001,Vente,12900,,,BOIS DES COTES,B015,63580,63340,Saint-Étienne-sur-Usson,63,,,63340000ZP0034,,,,,,,,,,,,,0,,,,,BR,futaies résineuses,,,295,3.374517,45.501045
2021-1077626,2021-12-01,000001,Vente,12900,,,BOIS DES COTES,B015,63580,63340,Saint-Étienne-sur-Usson,63,,,63340000ZP0037,,,,,,,,,,,,,0,,,,,BR,futaies résineuses,,,1575,3.372024,45.501655
2021-1077626,2021-12-01,000001,Vente,12900,,,LIZAT,B089,63580,63340,Saint-Étienne-sur-Usson,63,,,63340000ZP0066,,,,,,,,,,,,,0,,,,,BR,futaies résineuses,,,400,3.376805,45.499098
2021-1077626,2021-12-01,000001,Vente,12900,,,LIZAT,B089,63580,63340,Saint-Étienne-sur-Usson,63,,,63340000ZP0079,,,,,,,,,,,,,0,,,,,BR,futaies résineuses,,,2660,3.379498,45.498234
2021-1077626,2021-12-01,000001,Vente,12900,,,LIZAT,B089,63580,63340,Saint-Étienne-sur-Usson,63,,,63340000ZP0080,,,,,,,,,,,,,0,,,,,BR,futaies résineuses,,,2060,3.379093,45.49801
2021-1077992,2021-12-17,000002,Vente,45000,,,LA BESSEDE,B011,63580,63340,Saint-Étienne-sur-Usson,63,,,63340000ZH0061,,,,,,,,,,,,,0,,,,,S,sols,,,85,3.411412,45.51679
2021-1077992,2021-12-17,000002,Vente,45000,5640,,LA BESSEDE,B011,63580,63340,Saint-Étienne-sur-Usson,63,,,63340000ZH0116,,,,,,,,,,,,,0,3,Dépendance,,0,P,prés,,,966,3.411164,45.516623
2021-1077992,2021-12-17,000002,Vente,45000,,,LA BESSEDE,B011,63580,63340,Saint-Étienne-sur-Usson,63,,,63340000ZH0118,,,,,,,,,,,,,0,,,,,S,sols,,,10,3.411429,45.516735
2021-1077992,2021-12-17,000002,Vente,45000,,,LA BESSEDE,B011,63580,63340,Saint-Étienne-sur-Usson,63,,,63340000ZH0119,,,,,,,,,,,,,0,,,,,S,sols,,,36,3.411315,45.516657
2021-1078308,2021-12-14,000001,Vente,60200,5633,,LA BESSEDE,B011,63580,63340,Saint-Étienne-sur-Usson,63,,,63340000ZH0113,,,,,,,,,,,,,0,1,Maison,105,4,S,sols,,,500,3.410134,45.516592
2021-1078308,2021-12-14,000001,Vente,60200,5633,,LA BESSEDE,B011,63580,63340,Saint-Étienne-sur-Usson,63,,,63340000ZH0113,,,,,,,,,,,,,0,1,Maison,105,4,J,jardins,,,1501,3.410134,45.516592
2021-1078308,2021-12-14,000001,Vente,60200,5633,,LA BESSEDE,B011,63580,63340,Saint-Étienne-sur-Usson,63,,,63340000ZH0113,,,,,,,,,,,,,0,3,Dépendance,,0,J,jardins,,,1501,3.410134,45.516592
2021-1078308,2021-12-14,000001,Vente,60200,5633,,LA BESSEDE,B011,63580,63340,Saint-Étienne-sur-Usson,63,,,63340000ZH0113,,,,,,,,,,,,,0,3,Dépendance,,0,S,sols,,,500,3.410134,45.516592
2021-1078308,2021-12-14,000001,Vente,60200,5633,,LA BESSEDE,B011,63580,63340,Saint-Étienne-sur-Usson,63,,,63340000ZH0113,,,,,,,,,,,,,0,3,Dépendance,,0,S,sols,,,500,3.410134,45.516592
2021-1078308,2021-12-14,000001,Vente,60200,5633,,LA BESSEDE,B011,63580,63340,Saint-Étienne-sur-Usson,63,,,63340000ZH0113,,,,,,,,,,,,,0,3,Dépendance,,0,J,jardins,,,1501,3.410134,45.516592
2021-1078485,2021-12-10,000001,Vente,205000,5639,,SAINT ETIENNE,B128,63580,63340,Saint-Étienne-sur-Usson,63,,,63340000ZK0158,,,,,,,,,,,,,0,1,Maison,94,4,S,sols,,,500,3.412992,45.506711
2021-1078485,2021-12-10,000001,Vente,205000,5639,,SAINT ETIENNE,B128,63580,63340,Saint-Étienne-sur-Usson,63,,,63340000ZK0158,,,,,,,,,,,,,0,1,Maison,94,4,T,terres,,,466,3.412992,45.506711
2021-1079485,2021-12-30,000001,Vente,57000,5645,,CHABREYRAS,B027,63580,63340,Saint-Étienne-sur-Usson,63,,,63340000ZE0327,,,,,,,,,,,,,0,1,Maison,48,3,S,sols,,,500,3.396983,45.525832
2021-1079485,2021-12-30,000001,Vente,57000,5645,,CHABREYRAS,B027,63580,63340,Saint-Étienne-sur-Usson,63,,,63340000ZE0327,,,,,,,,,,,,,0,1,Maison,48,3,J,jardins,,,236,3.396983,45.525832
2021-1079788,2021-12-03,000001,Vente,3105,,,GRAFELIDE,B074,63580,63340,Saint-Étienne-sur-Usson,63,,,63340000ZN0034,,,,,,,,,,,,,0,,,,,BS,taillis sous futaie,,,14670,3.38961,45.494227
2021-1079788,2021-12-03,000001,Vente,3105,,,LA BARAQUE,B001,63580,63340,Saint-Étienne-sur-Usson,63,,,63340000ZN0047,,,,,,,,,,,,,0,,,,,PA,pâtures,,,5095,3.386684,45.489299
2021-1079788,2021-12-03,000001,Vente,3105,,,LES PERIAUX,B101,63580,63340,Saint-Étienne-sur-Usson,63,,,63340000ZO0028,,,,,,,,,,,,,0,,,,,BR,futaies résineuses,,,6615,3.374746,45.499511
2021-1079788,2021-12-03,000001,Vente,3105,,,BOIS DE CHENES,B014,63580,63340,Saint-Étienne-sur-Usson,63,,,63340000ZO0093,,,,,,,,,,,,,0,,,,,BS,taillis sous futaie,,,13815,3.393205,45.494475
2021-1082066,2021-01-21,000001,Vente,64850,,,BERME BAS,B008,63580,63340,Saint-Étienne-sur-Usson,63,,,63340000ZS0123,,,,,,,,,,,,,0,,,,,J,jardins,,,407,3.393653,45.511065
2021-1082066,2021-01-21,000001,Vente,64850,5147,,BERME BAS,B008,63580,63340,Saint-Étienne-sur-Usson,63,,,63340000ZS0174,,,,,,,,,,,,,0,1,Maison,95,3,S,sols,,,110,3.393652,45.51091
2021-1082066,2021-01-21,000001,Vente,64850,,,BERME BAS,B008,63580,63340,Saint-Étienne-sur-Usson,63,,,63340000ZS0175,,,,,,,,,,,,,0,,,,,S,sols,,,64,3.393755,45.510905
2021-1082066,2021-01-21,000001,Vente,64850,,,BERME BAS,B008,63580,63340,Saint-Étienne-sur-Usson,63,,,63340000ZS0176,,,,,,,,,,,,,0,,,,,S,sols,,,42,3.393674,45.511014
2021-1082142,2021-02-05,000001,Vente,38000,,,SAINT ETIENNE,B128,63580,63340,Saint-Étienne-sur-Usson,63,,,63340000ZK0083,,,,,,,,,,,,,0,,,,,S,sols,,,113,3.412574,45.506492
2021-1082142,2021-02-05,000001,Vente,38000,5019,,SAINT ETIENNE,B128,63580,63340,Saint-Étienne-sur-Usson,63,,,63340000ZK0084,,,,,,,,,,,,,0,1,Maison,60,4,S,sols,,,50,3.412684,45.506489
2021-1082142,2021-02-05,000001,Vente,38000,5019,,SAINT ETIENNE,B128,63580,63340,Saint-Étienne-sur-Usson,63,,,63340000ZK0086,,,,,,,,,,,,,0,3,Dépendance,,0,P,prés,,,1080,3.413114,45.506444
2021-1082142,2021-02-05,000001,Vente,38000,5019,,SAINT ETIENNE,B128,63580,63340,Saint-Étienne-sur-Usson,63,,,63340000ZK0086,,,,,,,,,,,,,0,3,Dépendance,,0,S,sols,,,46,3.413114,45.506444
2021-1082280,2021-03-09,000001,Vente,47500,5645,,CHABREYRAS,B027,63580,63340,Saint-Étienne-sur-Usson,63,,,63340000ZE0327,,,,,,,,,,,,,0,1,Maison,48,3,J,jardins,,,236,3.396983,45.525832
2021-1082280,2021-03-09,000001,Vente,47500,5645,,CHABREYRAS,B027,63580,63340,Saint-Étienne-sur-Usson,63,,,63340000ZE0327,,,,,,,,,,,,,0,1,Maison,48,3,S,sols,,,500,3.396983,45.525832
2021-1082346,2021-03-17,000001,Vente,71000,,,LES FAVINS,B054,63580,63340,Saint-Étienne-sur-Usson,63,,,63340000ZN0012,,,,,,,,,,,,,0,,,,,T,terres,,,630,3.381082,45.49309
2021-1082346,2021-03-17,000001,Vente,71000,5203,,CHAUVAYE,B037,63580,63340,Saint-Étienne-sur-Usson,63,,,63340000ZN0074,,,,,,,,,,,,,0,1,Maison,60,3,S,sols,,,635,3.38209,45.491182
2021-1082464,2021-04-06,000001,Vente,34475,,,LES SAGNES,B124,63580,63340,Saint-Étienne-sur-Usson,63,,,63340000ZI0030,,,,,,,,,,,,,0,,,,,T,terres,,,2810,3.426585,45.506906
2021-1082464,2021-04-06,000001,Vente,34475,,,LES SAGNES,B124,63580,63340,Saint-Étienne-sur-Usson,63,,,63340000ZI0031,,,,,,,,,,,,,0,,,,,T,terres,,,9080,3.427928,45.5077
2021-1082464,2021-04-06,000001,Vente,34475,,,LES SAGNES,B124,63580,63340,Saint-Étienne-sur-Usson,63,,,63340000ZI0031,,,,,,,,,,,,,0,,,,,BR,futaies résineuses,,,1630,3.427928,45.5077
2021-1082464,2021-04-06,000001,Vente,34475,,,LES SAGNES,B124,63580,63340,Saint-Étienne-sur-Usson,63,,,63340000ZI0031,,,,,,,,,,,,,0,,,,,P,prés,,,3770,3.427928,45.5077
2021-1082464,2021-04-06,000001,Vente,34475,,,LES SAGNES,B124,63580,63340,Saint-Étienne-sur-Usson,63,,,63340000ZI0031,,,,,,,,,,,,,0,,,,,BT,taillis simples,,,9390,3.427928,45.5077
2021-1082464,2021-04-06,000001,Vente,34475,,,BERTHO HAUT,B010,63580,63340,Saint-Étienne-sur-Usson,63,,,63340000ZI0062,,,,,,,,,,,,,0,,,,,T,terres,,,10630,3.431133,45.507269
2021-1082464,2021-04-06,000001,Vente,34475,,,BERTHO HAUT,B010,63580,63340,Saint-Étienne-sur-Usson,63,,,63340000ZI0062,,,,,,,,,,,,,0,,,,,P,prés,,,2670,3.431133,45.507269
2021-1082464,2021-04-06,000001,Vente,34475,,,BERTHO HAUT,B010,63580,63340,Saint-Étienne-sur-Usson,63,,,63340000ZI0062,,,,,,,,,,,,,0,,,,,BT,taillis simples,,,4750,3.431133,45.507269
2021-1082464,2021-04-06,000001,Vente,34475,,,BERTHO HAUT,B010,63580,63340,Saint-Étienne-sur-Usson,63,,,63340000ZI0064,,,,,,,,,,,,,0,,,,,P,prés,,,12510,3.431021,45.506423
2021-1082464,2021-04-06,000001,Vente,34475,,,BERTHO HAUT,B010,63580,63340,Saint-Étienne-sur-Usson,63,,,63340000ZI0064,,,,,,,,,,,,,0,,,,,T,terres,,,6250,3.431021,45.506423
2021-1082464,2021-04-06,000001,Vente,34475,,,DIGNET,B049,63580,63340,Saint-Étienne-sur-Usson,63,,,63340000ZI0120,,,,,,,,,,,,,0,,,,,BT,taillis simples,,,9415,3.418845,45.505695
2021-1082464,2021-04-06,000001,Vente,34475,,,RIBEYRE,B117,63580,63340,Saint-Étienne-sur-Usson,63,,,63340000ZK0164,,,,,,,,,,,,,0,,,,,L,landes,,,12160,3.417958,45.505057
2021-1082464,2021-04-06,000001,Vente,34475,,,RIBEYRE,B117,63580,63340,Saint-Étienne-sur-Usson,63,,,63340000ZK0164,,,,,,,,,,,,,0,,,,,P,prés,,,15870,3.417958,45.505057
2021-1082464,2021-04-06,000001,Vente,34475,,,RIBEYRE,B117,63580,63340,Saint-Étienne-sur-Usson,63,,,63340000ZK0164,,,,,,,,,,,,,0,,,,,T,terres,,,47673,3.417958,45.505057
