id_mutation,date_mutation,numero_disposition,nature_mutation,valeur_fonciere,adresse_numero,adresse_suffixe,adresse_nom_voie,adresse_code_voie,code_postal,code_commune,nom_commune,code_departement,ancien_code_commune,ancien_nom_commune,id_parcelle,ancien_id_parcelle,numero_volume,lot1_numero,lot1_surface_carrez,lot2_numero,lot2_surface_carrez,lot3_numero,lot3_surface_carrez,lot4_numero,lot4_surface_carrez,lot5_numero,lot5_surface_carrez,nombre_lots,code_type_local,type_local,surface_reelle_bati,nombre_pieces_principales,code_nature_culture,nature_culture,code_nature_culture_speciale,nature_culture_speciale,surface_terrain,longitude,latitude
2021-1068115,2021-06-14,000001,Vente,2800,,,PETIT CLERMONT,B050,63440,63391,Saint-Rémy-de-Blot,63,,,63391000ZL0056,,,,,,,,,,,,,0,,,,,T,terres,,,7405,2.938065,46.068477
2021-1069424,2021-06-29,000001,Vente,100000,,,LE BOURG,B067,63440,63391,Saint-Rémy-de-Blot,63,,,63391000ZN0267,,,,,,,,,,,,,0,,,,,AB,terrains a bâtir,,,1142,2.930454,46.078576
2021-1069965,2021-07-16,000001,Vente,157100,5025,A,LES COTES,B021,63440,63391,Saint-Rémy-de-Blot,63,,,63391000ZM0190,,,,,,,,,,,,,0,1,Maison,90,4,AG,terrains d'agrément,,,1678,2.924008,46.073845
2021-1069965,2021-07-16,000001,Vente,157100,5025,A,LES COTES,B021,63440,63391,Saint-Rémy-de-Blot,63,,,63391000ZM0190,,,,,,,,,,,,,0,1,Maison,90,4,S,sols,,,689,2.924008,46.073845
2021-1069965,2021-07-16,000001,Vente,157100,,,LES COTES,B021,63440,63391,Saint-Rémy-de-Blot,63,,,63391000ZM0191,,,,,,,,,,,,,0,,,,,P,prés,,,178,2.924381,46.073798
2021-1069965,2021-07-16,000001,Vente,157100,,,LES COTES,B021,63440,63391,Saint-Rémy-de-Blot,63,,,63391000ZM0191,,,,,,,,,,,,,0,,,,,P,prés,,,179,2.924381,46.073798
2021-1071444,2021-07-27,000001,Vente,3000,,,COTE GUILLAUME,B085,63440,63391,Saint-Rémy-de-Blot,63,,,63391000ZM0081,,,,,,,,,,,,,0,,,,,L,landes,,,5650,2.929047,46.068591
2021-1071444,2021-07-27,000001,Vente,3000,,,COTE GUILLAUME,B085,63440,63391,Saint-Rémy-de-Blot,63,,,63391000ZM0091,,,,,,,,,,,,,0,,,,,BT,taillis simples,,,3450,2.926733,46.07112
2021-1071593,2021-08-26,000001,Vente,15242.82,,,LA CHABASSE,B012,63440,63391,Saint-Rémy-de-Blot,63,,,63391000ZC0252,,,,,,,,,,,,,0,,,,,T,terres,,,51,2.95932,46.085152
2021-1071593,2021-08-26,000001,Vente,15242.82,,,BLOT ROCHER,B002,63440,63391,Saint-Rémy-de-Blot,63,,,63391000ZN0159,,,,,,,,,,,,,0,,,,,S,sols,,,17,2.927068,46.085411
2021-1071593,2021-08-26,000001,Vente,15242.82,5019,,BLOT ROCHER,B002,63440,63391,Saint-Rémy-de-Blot,63,,,63391000ZN0160,,,,,,,,,,,,,0,1,Maison,70,2,S,sols,,,73,2.927101,46.08537
2021-1071593,2021-08-26,000001,Vente,15242.82,,,LE BOURG,B067,63440,63391,Saint-Rémy-de-Blot,63,,,63391000ZN0268,,,,,,,,,,,,,0,,,,,AB,terrains a bâtir,,,1180,2.930792,46.078177
2021-1071669,2021-08-02,000001,Vente,126550,,,PONT DE MENAT,B052,63440,63391,Saint-Rémy-de-Blot,63,,,63391000ZA0094,,,,,,,,,,,,,0,,,,,L,landes,,,87,2.931475,46.100834
2021-1071669,2021-08-02,000001,Vente,126550,5203,,PONT DE MENAT,B052,63440,63391,Saint-Rémy-de-Blot,63,,,63391000ZA0095,,,,,,,,,,,,,0,3,Dépendance,,0,S,sols,,,207,2.931544,46.100898
2021-1071669,2021-08-02,000001,Vente,126550,5203,,PONT DE MENAT,B052,63440,63391,Saint-Rémy-de-Blot,63,,,63391000ZA0095,,,,,,,,,,,,,0,1,Maison,80,4,S,sols,,,207,2.931544,46.100898
2021-1071669,2021-08-02,000001,Vente,126550,5203,,PONT DE MENAT,B052,63440,63391,Saint-Rémy-de-Blot,63,,,63391000ZA0095,,,,,,,,,,,,,0,3,Dépendance,,0,S,sols,,,207,2.931544,46.100898
2021-1072605,2021-09-03,000001,Vente,98400,5083,,LA CARRIERE,B090,63440,63391,Saint-Rémy-de-Blot,63,,,63391000ZB0275,,,,,,,,,,,,,0,1,Maison,119,6,S,sols,,,340,2.951193,46.093044
2021-1072605,2021-09-03,000001,Vente,98400,5083,,LA CARRIERE,B090,63440,63391,Saint-Rémy-de-Blot,63,,,63391000ZB0275,,,,,,,,,,,,,0,3,Dépendance,,0,S,sols,,,340,2.951193,46.093044
2021-1072605,2021-09-03,000001,Vente,98400,,,LES FRAISSES,B029,63440,63391,Saint-Rémy-de-Blot,63,,,63391000ZB0292,,,,,,,,,,,,,0,,,,,S,sols,,,50,2.950982,46.093061
2021-1073750,2021-09-21,000001,Vente,167000,,,PETIT CLERMONT,B050,63440,63391,Saint-Rémy-de-Blot,63,,,63391000ZL0050,,,,,,,,,,,,,0,,,,,L,landes,,,176,2.939708,46.06818
2021-1073750,2021-09-21,000001,Vente,167000,,,PETIT CLERMONT,B050,63440,63391,Saint-Rémy-de-Blot,63,,,63391000ZL0112,,,,,,,,,,,,,0,,,,,P,prés,,,7785,2.940501,46.068093
2021-1073750,2021-09-21,000001,Vente,167000,5150,,PETIT CLERMONT,B050,63440,63391,Saint-Rémy-de-Blot,63,,,63391000ZL0113,,,,,,,,,,,,,0,1,Maison,144,5,S,sols,,,3082,2.939264,46.068799
2021-1073750,2021-09-21,000001,Vente,167000,5150,,PETIT CLERMONT,B050,63440,63391,Saint-Rémy-de-Blot,63,,,63391000ZL0113,,,,,,,,,,,,,0,1,Maison,144,5,P,prés,,,4830,2.939264,46.068799
2021-1073750,2021-09-21,000001,Vente,167000,5150,,PETIT CLERMONT,B050,63440,63391,Saint-Rémy-de-Blot,63,,,63391000ZL0113,,,,,,,,,,,,,0,1,Maison,144,5,E,eaux,ETANG,Etangs,870,2.939264,46.068799
2021-1074669,2021-09-24,000001,Vente,800,,,LA SANS,B069,63440,63391,Saint-Rémy-de-Blot,63,,,63391000ZK0158,,,,,,,,,,,,,0,,,,,BT,taillis simples,,,6500,2.952355,46.076174
2021-1078121,2021-11-23,000001,Vente,1750,,,LES FAYOLLES,B028,63440,63391,Saint-Rémy-de-Blot,63,,,63391000ZC0090,,,,,,,,,,,,,0,,,,,BT,taillis simples,,,10447,2.948953,46.083104
2021-1078121,2021-11-23,000001,Vente,1750,,,LES BOIS DE LA FAYE,B003,63440,63391,Saint-Rémy-de-Blot,63,,,63391000ZC0174,,,,,,,,,,,,,0,,,,,BT,taillis simples,,,1840,2.953703,46.081256
2021-1078123,2021-11-23,000001,Vente,1250,,,LA CHABASSE,B012,63440,63391,Saint-Rémy-de-Blot,63,,,63391000ZC0190,,,,,,,,,,,,,0,,,,,BT,taillis simples,,,10310,2.961575,46.083628
2021-1078813,2021-12-17,000001,Vente,220000,,,MALMOUCHE,B043,63440,63391,Saint-Rémy-de-Blot,63,,,63391000ZL0070,,,,,,,,,,,,,0,,,,,J,jardins,,,265,2.933748,46.072081
2021-1078813,2021-12-17,000001,Vente,220000,,,MALMOUCHE,B043,63440,63391,Saint-Rémy-de-Blot,63,,,63391000ZL0082,,,,,,,,,,,,,0,,,,,P,prés,,,1330,2.933337,46.072285
2021-1078813,2021-12-17,000001,Vente,220000,5152,,MALMOUCHE,B043,63440,63391,Saint-Rémy-de-Blot,63,,,63391000ZL0083,,,,,,,,,,,,,0,3,Dépendance,,0,S,sols,,,340,2.933358,46.072127
2021-1078813,2021-12-17,000001,Vente,220000,5152,,MALMOUCHE,B043,63440,63391,Saint-Rémy-de-Blot,63,,,63391000ZL0083,,,,,,,,,,,,,0,1,Maison,139,3,S,sols,,,340,2.933358,46.072127
2021-1078813,2021-12-17,000001,Vente,220000,,,MALMOUCHES OUEST,B089,63440,63391,Saint-Rémy-de-Blot,63,,,63391000ZM0023,,,,,,,,,,,,,0,,,,,P,prés,,,3149,2.932724,46.072678
2021-1079907,2021-01-13,000002,Vente,2500,,,LA MOUZIERE,B044,63440,63391,Saint-Rémy-de-Blot,63,,,63391000ZE0023,,,,,,,,,,,,,0,,,,,BS,taillis sous futaie,,,2994,2.989533,46.06896
2021-1079907,2021-01-13,000002,Vente,2500,,,LA MOUZIERE,B044,63440,63391,Saint-Rémy-de-Blot,63,,,63391000ZE0064,,,,,,,,,,,,,0,,,,,BS,taillis sous futaie,,,2683,2.990448,46.068443
2021-1080218,2021-02-18,000001,Vente,103950,5030,,LES COTES,B021,63440,63391,Saint-Rémy-de-Blot,63,,,63391000ZM0048,,,,,,,,,,,,,0,1,Maison,133,5,P,prés,,,2987,2.921958,46.073391
2021-1080218,2021-02-18,000001,Vente,103950,5030,,LES COTES,B021,63440,63391,Saint-Rémy-de-Blot,63,,,63391000ZM0048,,,,,,,,,,,,,0,3,Dépendance,,0,S,sols,,,2654,2.921958,46.073391
2021-1080218,2021-02-18,000001,Vente,103950,5030,,LES COTES,B021,63440,63391,Saint-Rémy-de-Blot,63,,,63391000ZM0048,,,,,,,,,,,,,0,1,Maison,133,5,S,sols,,,2654,2.921958,46.073391
2021-1080218,2021-02-18,000001,Vente,103950,5030,,LES COTES,B021,63440,63391,Saint-Rémy-de-Blot,63,,,63391000ZM0048,,,,,,,,,,,,,0,3,Dépendance,,0,P,prés,,,2987,2.921958,46.073391
2021-1080595,2021-03-13,000001,Vente,80000,5052,,PONT DE MENAT,B052,63440,63391,Saint-Rémy-de-Blot,63,,,63391000ZA0099,,,,,,,,,,,,,0,1,Maison,55,2,S,sols,,,163,2.932003,46.100845
2021-1080595,2021-03-13,000001,Vente,80000,5052,,PONT DE MENAT,B052,63440,63391,Saint-Rémy-de-Blot,63,,,63391000ZA0099,,,,,,,,,,,,,0,1,Maison,55,2,J,jardins,,,767,2.932003,46.100845
2021-1080677,2021-04-01,000001,Vente,27000,,,CHOMEIL,B019,63440,63391,Saint-Rémy-de-Blot,63,,,63391000ZB0010,,,,,,,,,,,,,0,,,,,P,prés,,,147,2.939274,46.092469
2021-1080677,2021-04-01,000001,Vente,27000,5071,,CHOMEIL,B019,63440,63391,Saint-Rémy-de-Blot,63,,,63391000ZB0181,,,,,,,,,,,,,0,1,Maison,90,3,S,sols,,,520,2.939278,46.092307
2021-1080677,2021-04-01,000001,Vente,27000,,,CHOMEIL,B019,63440,63391,Saint-Rémy-de-Blot,63,,,63391000ZB0217,,,,,,,,,,,,,0,,,,,J,jardins,,,770,2.940043,46.092205
