id_mutation,date_mutation,numero_disposition,nature_mutation,valeur_fonciere,adresse_numero,adresse_suffixe,adresse_nom_voie,adresse_code_voie,code_postal,code_commune,nom_commune,code_departement,ancien_code_commune,ancien_nom_commune,id_parcelle,ancien_id_parcelle,numero_volume,lot1_numero,lot1_surface_carrez,lot2_numero,lot2_surface_carrez,lot3_numero,lot3_surface_carrez,lot4_numero,lot4_surface_carrez,lot5_numero,lot5_surface_carrez,nombre_lots,code_type_local,type_local,surface_reelle_bati,nombre_pieces_principales,code_nature_culture,nature_culture,code_nature_culture_speciale,nature_culture_speciale,surface_terrain,longitude,latitude
2021-1067021,2021-05-12,000001,Vente,400,,,SUQUET DE BEAU,B318,63580,63448,Le Vernet-Chaméane,63,,,63448000ZV0134,,,,,,,,,,,,,0,,,,,BT,taillis simples,,,2303,3.441725,45.455804
2021-1067021,2021-05-12,000001,Vente,400,,,SUQUET DE BEAU,B318,63580,63448,Le Vernet-Chaméane,63,,,63448000ZV0134,,,,,,,,,,,,,0,,,,,BR,futaies résineuses,,,2302,3.441725,45.455804
2021-1067022,2021-05-12,000001,Vente,500,,,DERRIERE LES BATIMENTS,B131,63580,63448,Le Vernet-Chaméane,63,,,63448000ZP0010,,,,,,,,,,,,,0,,,,,BR,futaies résineuses,,,1720,3.470939,45.465155
2021-1067022,2021-05-12,000001,Vente,500,,,LA BATISSE,B011,63580,63448,Le Vernet-Chaméane,63,,,63448000ZT0088,,,,,,,,,,,,,0,,,,,BT,taillis simples,,,552,3.458377,45.456049
2021-1067022,2021-05-12,000001,Vente,500,,,LA CREPE,B117,63580,63448,Le Vernet-Chaméane,63,,,63448000ZT0287,,,,,,,,,,,,,0,,,,,BT,taillis simples,,,2680,3.453393,45.456926
2021-1067022,2021-05-12,000001,Vente,500,,,SUQUET DE BEAU,B318,63580,63448,Le Vernet-Chaméane,63,,,63448000ZV0132,,,,,,,,,,,,,0,,,,,BT,taillis simples,,,1435,3.440969,45.456097
2021-1067025,2021-05-12,000001,Vente,250,,,PINDILLIER,B237,63580,63448,Le Vernet-Chaméane,63,,,63448000AK0025,,,,,,,,,,,,,0,,,,,BR,futaies résineuses,,,3135,3.475018,45.499714
2021-1067025,2021-05-12,000001,Vente,250,,,MEJAMET,B199,63580,63448,Le Vernet-Chaméane,63,,,63448000ZI0012,,,,,,,,,,,,,0,,,,,L,landes,,,8140,3.471212,45.49272
2021-1067029,2021-05-14,000001,Vente,21000,13,,RTE DE SAINT GERMAIN,0048,63580,63448,Le Vernet-Chaméane,63,,,63448000AH0142,,,,,,,,,,,,,0,1,Maison,33,2,S,sols,,,34,3.452815,45.474204
2021-1067048,2021-05-12,000001,Vente,825,,,LA CARTADE,B053,63580,63448,Le Vernet-Chaméane,63,,,63448000ZI0089,,,,,,,,,,,,,0,,,,,BR,futaies résineuses,,,16510,3.476297,45.492976
2021-1067566,2021-06-11,000001,Vente,34300,5173,,LE BOURG,B041,63580,63448,Le Vernet-Chaméane,63,,,63448000AD0126,,,22,37,,,,,,,,,1,1,Maison,40,2,,,,,,3.446956,45.476048
2021-1067592,2021-05-21,000001,Vente,150,5748,,LA VOISSIERE,B340,63580,63448,Le Vernet-Chaméane,63,,,63448000ZC0013,,,,,,,,,,,,,0,3,Dépendance,,0,L,landes,,,58,3.449468,45.487674
2021-1067592,2021-05-21,000001,Vente,150,,,LA VOISSIERE,B340,63580,63448,Le Vernet-Chaméane,63,,,63448000ZC0014,,,,,,,,,,,,,0,,,,,S,sols,,,84,3.449422,45.487718
2021-1067741,2021-06-03,000001,Vente,100,,,LA COLOMBE,B102,63580,63448,Le Vernet-Chaméane,63,,,63448000ZN0087,,,,,,,,,,,,,0,,,,,BR,futaies résineuses,,,2200,3.491735,45.478387
2021-1067855,2021-06-03,000001,Vente,95,,,LA COLOMBE,B102,63580,63448,Le Vernet-Chaméane,63,,,63448000ZN0086,,,,,,,,,,,,,0,,,,,BR,futaies résineuses,,,1920,3.491641,45.478649
2021-1068547,2021-06-15,000001,Vente,8000,,,CHAMP CHABRE,B060,63580,63448,Le Vernet-Chaméane,63,,,63448000ZR0030,,,,,,,,,,,,,0,,,,,BR,futaies résineuses,,,7400,3.475478,45.470996
2021-1068547,2021-06-15,000001,Vente,8000,,,PINATEL,B233,63580,63448,Le Vernet-Chaméane,63,,,63448000ZR0041,,,,,,,,,,,,,0,,,,,BR,futaies résineuses,,,124230,3.472273,45.471506
2021-1068679,2021-06-18,000001,Vente,350,,,LA CHOTE,B096,63580,63448,Le Vernet-Chaméane,63,,,63448000AI0093,,,,,,,,,,,,,0,,,,,BR,futaies résineuses,,,4207,3.467128,45.486115
2021-1068679,2021-06-18,000001,Vente,350,,,LA CHOTE,B096,63580,63448,Le Vernet-Chaméane,63,,,63448000AI0093,,,,,,,,,,,,,0,,,,,B,bois,,,1803,3.467128,45.486115
2021-1068679,2021-06-18,000001,Vente,350,,,LES BOIS NOIRS,B038,63580,63448,Le Vernet-Chaméane,63,,,63448000AL0079,,,,,,,,,,,,,0,,,,,BR,futaies résineuses,,,489,3.511807,45.477547
2021-1069197,2021-06-30,000001,Vente,55000,,,TOIRAS,B326,63580,63448,Le Vernet-Chaméane,63,,,63448000ZB0437,,,,,,,,,,,,,0,,,,,S,sols,,,70,3.428881,45.49043
2021-1069197,2021-06-30,000001,Vente,55000,5445,B,TOIRAS,B326,63580,63448,Le Vernet-Chaméane,63,,,63448000ZB0447,,,,,,,,,,,,,0,3,Dépendance,,0,S,sols,,,262,3.428829,45.490378
2021-1069197,2021-06-30,000001,Vente,55000,5445,B,TOIRAS,B326,63580,63448,Le Vernet-Chaméane,63,,,63448000ZB0447,,,,,,,,,,,,,0,1,Maison,65,3,S,sols,,,262,3.428829,45.490378
2021-1069197,2021-06-30,000001,Vente,55000,,,TOIRAS,B326,63580,63448,Le Vernet-Chaméane,63,,,63448000ZB0460,,,,,,,,,,,,,0,,,,,S,sols,,,41,3.428652,45.490348
2021-1069197,2021-06-30,000001,Vente,55000,,,TOIRAS,B326,63580,63448,Le Vernet-Chaméane,63,,,63448000ZB0461,,,,,,,,,,,,,0,,,,,S,sols,,,29,3.428864,45.490307
2021-1069439,2021-07-13,000001,Vente,207668,5465,,ESBELIN,B141,63580,63448,Le Vernet-Chaméane,63,,,63448000ZD0061,,,,,,,,,,,,,0,3,Dépendance,,0,S,sols,,,1510,3.439793,45.495272
2021-1069439,2021-07-13,000001,Vente,207668,5465,,ESBELIN,B141,63580,63448,Le Vernet-Chaméane,63,,,63448000ZD0061,,,,,,,,,,,,,0,3,Dépendance,,0,S,sols,,,1510,3.439793,45.495272
2021-1069439,2021-07-13,000001,Vente,207668,5465,,ESBELIN,B141,63580,63448,Le Vernet-Chaméane,63,,,63448000ZD0061,,,,,,,,,,,,,0,1,Maison,60,2,S,sols,,,1510,3.439793,45.495272
2021-1069658,2021-06-30,000001,Vente,176500,,,SUQUET DE LA GARDE,B319,63580,63448,Le Vernet-Chaméane,63,,,63448000ZK0278,,,,,,,,,,,,,0,,,,,P,prés,,,17953,3.487253,45.484816
2021-1069658,2021-06-30,000001,Vente,176500,,,GRAND CHAMP,B178,63580,63448,Le Vernet-Chaméane,63,,,63448000ZK0280,,,,,,,,,,,,,0,,,,,T,terres,,,2330,3.488219,45.484936
2021-1069683,2021-07-13,000001,Vente,202000,,,LE BOURG,B041,63580,63448,Le Vernet-Chaméane,63,,,63448000AH0110,,,,,,,,,,,,,0,,,,,J,jardins,,,581,3.453935,45.47517
2021-1069683,2021-07-13,000001,Vente,202000,20,,CHE DES NATIONS,0030,63580,63448,Le Vernet-Chaméane,63,,,63448000AH0111,,,,,,,,,,,,,0,3,Dépendance,,0,S,sols,,,180,3.453785,45.475392
2021-1069683,2021-07-13,000001,Vente,202000,20,,CHE DES NATIONS,0030,63580,63448,Le Vernet-Chaméane,63,,,63448000AH0111,,,,,,,,,,,,,0,1,Maison,114,4,S,sols,,,180,3.453785,45.475392
2021-1069906,2021-06-30,000001,Vente,157090,,,LE PRAT,B254,63580,63448,Le Vernet-Chaméane,63,,,63448000ZI0037,,,,,,,,,,,,,0,,,,,S,sols,,,30,3.475508,45.491472
2021-1069906,2021-06-30,000001,Vente,157090,5372,,LE PRAT,B254,63580,63448,Le Vernet-Chaméane,63,,,63448000ZI0039,,,,,,,,,,,,,0,1,Maison,120,4,S,sols,,,215,3.475346,45.491786
2021-1069906,2021-06-30,000001,Vente,157090,,,LE PRAT,B254,63580,63448,Le Vernet-Chaméane,63,,,63448000ZI0040,,,,,,,,,,,,,0,,,,,S,sols,,,74,3.475298,45.491701
2021-1070029,2021-07-16,000001,Vente,100000,5007,,CHAMEANE,B358,63580,63448,Le Vernet-Chaméane,63,,,63448078ZD0041,,,,,,,,,,,,,0,1,Maison,131,6,S,sols,,,850,3.451084,45.513563
2021-1070029,2021-07-16,000001,Vente,100000,,,CHAMEANE,B358,63580,63448,Le Vernet-Chaméane,63,,,63448078ZD0117,,,,,,,,,,,,,0,,,,,S,sols,,,165,3.451242,45.513561
2021-1070166,2021-07-20,000001,Vente,300,,,LES PINATELLES,B235,63580,63448,Le Vernet-Chaméane,63,,,63448000AL0038,,,,,,,,,,,,,0,,,,,BR,futaies résineuses,,,2915,3.507893,45.474741
2021-1070178,2021-07-16,000001,Vente,15000,,,CHAPON,B080,63580,63448,Le Vernet-Chaméane,63,,,63448000ZS0097,,,,,,,,,,,,,0,,,,,S,sols,,,223,3.453716,45.463873
2021-1070178,2021-07-16,000001,Vente,15000,,,CHAPON,B080,63580,63448,Le Vernet-Chaméane,63,,,63448000ZS0099,,,,,,,,,,,,,0,,,,,J,jardins,,,557,3.453883,45.463243
2021-1070178,2021-07-16,000001,Vente,15000,,,CHAPON,B080,63580,63448,Le Vernet-Chaméane,63,,,63448000ZS0100,,,,,,,,,,,,,0,,,,,P,prés,,,2300,3.453137,45.463289
2021-1070178,2021-07-16,000001,Vente,15000,,,CHAPON,B080,63580,63448,Le Vernet-Chaméane,63,,,63448000ZS0148,,,,,,,,,,,,,0,,,,,P,prés,,,223,3.453297,45.463963
2021-1070178,2021-07-16,000001,Vente,15000,5242,,CHAPON,B080,63580,63448,Le Vernet-Chaméane,63,,,63448000ZS0149,,,,,,,,,,,,,0,1,Maison,103,4,S,sols,,,870,3.453571,45.464044
2021-1070899,2021-06-19,000001,Vente,1400,,,GRANGE BARRIERE,B182,63580,63448,Le Vernet-Chaméane,63,,,63448000ZM0244,,,,,,,,,,,,,0,,,,,BR,futaies résineuses,,,2010,3.499972,45.48296
2021-1071350,2021-08-03,000001,Vente,,5193,,LA SOUCHE,B302,63580,63448,Le Vernet-Chaméane,63,,,63448000ZA0118,,,,,,,,,,,,,0,1,Maison,84,3,S,sols,,,231,3.415903,45.481876
2021-1071350,2021-08-03,000001,Vente,,5193,,LA SOUCHE,B302,63580,63448,Le Vernet-Chaméane,63,,,63448000ZA0118,,,,,,,,,,,,,0,3,Dépendance,,0,S,sols,,,231,3.415903,45.481876
2021-1071350,2021-08-03,000001,Vente,,,,GRAND PRE,B180,63580,63448,Le Vernet-Chaméane,63,,,63448000ZA0120,,,,,,,,,,,,,0,,,,,P,prés,,,1190,3.416026,45.481532
2021-1071350,2021-08-03,000002,Vente,,,,LA SOUCHE,B302,63580,63448,Le Vernet-Chaméane,63,,,63448000ZA0117,,,,,,,,,,,,,0,,,,,S,sols,,,105,3.416044,45.482009
2021-1071966,2021-08-06,000001,Vente,43000,5173,,LE BOURG,B041,63580,63448,Le Vernet-Chaméane,63,,,63448000AD0126,,,12,42.78,,,,,,,,,1,1,Maison,49,3,,,,,,3.446956,45.476048
2021-1071967,2021-08-31,000001,Vente,2000,,,LE BOIS DE L HALE,B023,63580,63448,Le Vernet-Chaméane,63,,,63448000AB0152,,,,,,,,,,,,,0,,,,,BT,taillis simples,,,1565,3.398467,45.492352
2021-1071967,2021-08-31,000001,Vente,2000,,,LE BOIS DE L HALE,B023,63580,63448,Le Vernet-Chaméane,63,,,63448000AB0218,,,,,,,,,,,,,0,,,,,BT,taillis simples,,,694,3.400219,45.490511
2021-1071967,2021-08-31,000001,Vente,2000,,,LE BOIS DE L HALE,B023,63580,63448,Le Vernet-Chaméane,63,,,63448000AB0229,,,,,,,,,,,,,0,,,,,BT,taillis simples,,,1930,3.401038,45.490088
2021-1071967,2021-08-31,000001,Vente,2000,,,LE BOIS DE L HALE,B023,63580,63448,Le Vernet-Chaméane,63,,,63448000AB0234,,,,,,,,,,,,,0,,,,,BT,taillis simples,,,662,3.401295,45.489687
2021-1071967,2021-08-31,000001,Vente,2000,,,LE BOIS DE L HALE,B023,63580,63448,Le Vernet-Chaméane,63,,,63448000AB0251,,,,,,,,,,,,,0,,,,,BT,taillis simples,,,1040,3.402837,45.489031
2021-1072180,2021-09-04,000001,Vente,500,,,TORTIAT,B328,63580,63448,Le Vernet-Chaméane,63,,,63448000ZN0157,,,,,,,,,,,,,0,,,,,PA,pâtures,,,1341,3.486186,45.476417
2021-1072181,2021-09-04,000002,Vente,49500,5317,,LE PEIGNEUR,B226,63580,63448,Le Vernet-Chaméane,63,,,63448000ZN0003,,,,,,,,,,,,,0,3,Dépendance,,0,S,sols,,,200,3.486084,45.476458
2021-1072181,2021-09-04,000002,Vente,49500,5317,,LE PEIGNEUR,B226,63580,63448,Le Vernet-Chaméane,63,,,63448000ZN0003,,,,,,,,,,,,,0,1,Maison,74,3,S,sols,,,200,3.486084,45.476458
2021-1072409,2021-08-25,000001,Vente,44000,5173,,LE BOURG,B041,63580,63448,Le Vernet-Chaméane,63,,,63448000AD0126,,,40,36.05,,,,,,,,,1,1,Maison,40,2,,,,,,3.446956,45.476048
2021-1072628,2021-08-27,000001,Vente,691000,,,LA REYNERIE,B279,63580,63448,Le Vernet-Chaméane,63,,,63448000AC0071,,,,,,,,,,,,,0,,,,,BT,taillis simples,,,11260,3.434289,45.482837
2021-1072628,2021-08-27,000001,Vente,691000,,,LA REYNERIE,B279,63580,63448,Le Vernet-Chaméane,63,,,63448000AC0072,,,,,,,,,,,,,0,,,,,BR,futaies résineuses,,,39190,3.433219,45.483146
2021-1072628,2021-08-27,000001,Vente,691000,,,LA REYNERIE,B279,63580,63448,Le Vernet-Chaméane,63,,,63448000AC0073,,,,,,,,,,,,,0,,,,,P,prés,,,13120,3.432226,45.483144
2021-1072628,2021-08-27,000001,Vente,691000,,,LA REYNERIE,B279,63580,63448,Le Vernet-Chaméane,63,,,63448000AC0074,,,,,,,,,,,,,0,,,,,P,prés,,,845,3.431769,45.483106
2021-1072628,2021-08-27,000001,Vente,691000,,,LA REYNERIE,B279,63580,63448,Le Vernet-Chaméane,63,,,63448000AC0075,,,,,,,,,,,,,0,,,,,BR,futaies résineuses,,,5380,3.431092,45.481936
2021-1072628,2021-08-27,000001,Vente,691000,,,LA REYNERIE,B279,63580,63448,Le Vernet-Chaméane,63,,,63448000AC0076,,,,,,,,,,,,,0,,,,,P,prés,,,13610,3.431241,45.482591
2021-1072628,2021-08-27,000001,Vente,691000,,,LA REYNERIE,B279,63580,63448,Le Vernet-Chaméane,63,,,63448000AC0077,,,,,,,,,,,,,0,,,,,P,prés,,,649,3.430416,45.482264
2021-1072628,2021-08-27,000001,Vente,691000,5175,,LA REYNERIE,B279,63580,63448,Le Vernet-Chaméane,63,,,63448000AC0079,,,,,,,,,,,,,0,1,Maison,115,5,S,sols,,,4305,3.430821,45.483566
2021-1072628,2021-08-27,000001,Vente,691000,5175,,LA REYNERIE,B279,63580,63448,Le Vernet-Chaméane,63,,,63448000AC0079,,,,,,,,,,,,,0,4,Local industriel. commercial ou assimilé,,0,S,sols,,,4305,3.430821,45.483566
2021-1072628,2021-08-27,000001,Vente,691000,,,LA REYNERIE,B279,63580,63448,Le Vernet-Chaméane,63,,,63448000AC0080,,,,,,,,,,,,,0,,,,,BR,futaies résineuses,,,4900,3.430793,45.483695
2021-1072628,2021-08-27,000001,Vente,691000,,,LA REYNERIE,B279,63580,63448,Le Vernet-Chaméane,63,,,63448000AC0081,,,,,,,,,,,,,0,,,,,J,jardins,,,1860,3.430175,45.483165
2021-1072628,2021-08-27,000001,Vente,691000,,,LA REYNERIE,B279,63580,63448,Le Vernet-Chaméane,63,,,63448000AC0082,,,,,,,,,,,,,0,,,,,P,prés,,,10410,3.430097,45.482694
2021-1072628,2021-08-27,000001,Vente,691000,,,LA REYNERIE,B279,63580,63448,Le Vernet-Chaméane,63,,,63448000AC0083,,,,,,,,,,,,,0,,,,,P,prés,,,282,3.430218,45.481972
2021-1072628,2021-08-27,000001,Vente,691000,,,ETANG DE LA REYNERIC,B146,63580,63448,Le Vernet-Chaméane,63,,,63448000AD0068,,,,,,,,,,,,,0,,,,,E,eaux,ETANG,Etangs,6930,3.435025,45.482802
2021-1072628,2021-08-27,000001,Vente,691000,,,ETANG DE LA REYNERIC,B146,63580,63448,Le Vernet-Chaméane,63,,,63448000AD0069,,,,,,,,,,,,,0,,,,,BT,taillis simples,,,2920,3.435342,45.48279
2021-1073613,2021-09-23,000001,Vente,930,,,LA VESSE,B336,63580,63448,Le Vernet-Chaméane,63,,,63448000ZM0127,,,,,,,,,,,,,0,,,,,BR,futaies résineuses,,,1980,3.507612,45.480639
2021-1073613,2021-09-23,000001,Vente,930,,,LA VESSE,B336,63580,63448,Le Vernet-Chaméane,63,,,63448000ZM0129,,,,,,,,,,,,,0,,,,,BP,peupleraies,,,6095,3.505625,45.480506
2021-1073613,2021-09-23,000001,Vente,930,,,SOUS LA ROUTE,B309,63580,63448,Le Vernet-Chaméane,63,,,63448000ZM0136,,,,,,,,,,,,,0,,,,,BP,peupleraies,,,10360,3.504109,45.479838
2021-1073618,2021-09-23,000001,Vente,470,,,LES PINATELLES,B235,63580,63448,Le Vernet-Chaméane,63,,,63448000AL0051,,,,,,,,,,,,,0,,,,,BR,futaies résineuses,,,2310,3.510477,45.475148
2021-1073618,2021-09-23,000001,Vente,470,,,LES BOIS,B019,63580,63448,Le Vernet-Chaméane,63,,,63448000ZK0171,,,,,,,,,,,,,0,,,,,BR,futaies résineuses,,,1580,3.491965,45.487261
2021-1073618,2021-09-23,000001,Vente,470,,,PRES LES BOIS NOIRS,B271,63580,63448,Le Vernet-Chaméane,63,,,63448000ZM0112,,,,,,,,,,,,,0,,,,,BR,futaies résineuses,,,5270,3.50901,45.478569
2021-1073818,2021-09-10,000001,Vente,56000,,,ESBELIN,B141,63580,63448,Le Vernet-Chaméane,63,,,63448000ZD0062,,,,,,,,,,,,,0,,,,,J,jardins,,,905,3.439929,45.494987
2021-1073818,2021-09-10,000001,Vente,56000,,,ESBELIN,B141,63580,63448,Le Vernet-Chaméane,63,,,63448000ZD0062,,,,,,,,,,,,,0,,,,,S,sols,,,100,3.439929,45.494987
2021-1073818,2021-09-10,000001,Vente,56000,,,ESBELIN,B141,63580,63448,Le Vernet-Chaméane,63,,,63448000ZD0063,,,,,,,,,,,,,0,,,,,S,sols,,,215,3.440231,45.494951
2021-1073818,2021-09-10,000001,Vente,56000,5470,,ESBELIN,B141,63580,63448,Le Vernet-Chaméane,63,,,63448000ZD0068,,,,,,,,,,,,,0,3,Dépendance,,0,S,sols,,,252,3.439658,45.494954
2021-1073818,2021-09-10,000001,Vente,56000,5470,,ESBELIN,B141,63580,63448,Le Vernet-Chaméane,63,,,63448000ZD0068,,,,,,,,,,,,,0,1,Maison,35,2,S,sols,,,252,3.439658,45.494954
2021-1073818,2021-09-10,000001,Vente,56000,,,ESBELIN,B141,63580,63448,Le Vernet-Chaméane,63,,,63448000ZD0170,,,,,,,,,,,,,0,,,,,P,prés,,,102,3.440264,45.494875
2021-1074109,2021-09-14,000001,Vente,300,,,COTES ROBERT,B377,63580,63448,Le Vernet-Chaméane,63,,,63448078AB0231,,,,,,,,,,,,,0,,,,,BR,futaies résineuses,,,3090,3.414275,45.52902
2021-1074237,2021-09-24,000001,Vente,5000,29,,RTE DE SAINT GERMAIN,0048,63580,63448,Le Vernet-Chaméane,63,,,63448000AH0131,,,,,,,,,,,,,0,1,Maison,76,4,S,sols,,,179,3.453302,45.474301
2021-1074295,2021-10-07,000001,Vente,12500,15,,RTE DE SAINT GERMAIN,0048,63580,63448,Le Vernet-Chaméane,63,,,63448000AH0141,,,,,,,,,,,,,0,1,Maison,98,4,S,sols,,,70,3.452873,45.474231
2021-1074737,2021-10-07,000001,Vente,21100,,,BELLEVUE,B012,63580,63448,Le Vernet-Chaméane,63,,,63448000AE0008,,,,,,,,,,,,,0,,,,,BT,taillis simples,,,6950,3.432395,45.473514
2021-1074737,2021-10-07,000001,Vente,21100,,,BELLEVUE,B012,63580,63448,Le Vernet-Chaméane,63,,,63448000AE0009,,,,,,,,,,,,,0,,,,,L,landes,,,38050,3.43318,45.472337
2021-1074737,2021-10-07,000001,Vente,21100,,,BELLEVUE,B012,63580,63448,Le Vernet-Chaméane,63,,,63448000AE0083,,,,,,,,,,,,,0,,,,,L,landes,,,17515,3.436172,45.473923
2021-1074737,2021-10-07,000001,Vente,21100,,,BELLEVUE,B012,63580,63448,Le Vernet-Chaméane,63,,,63448000AE0084,,,,,,,,,,,,,0,,,,,L,landes,,,42107,3.43449,45.473672
2021-1074737,2021-10-07,000001,Vente,21100,,,BELLEVUE,B012,63580,63448,Le Vernet-Chaméane,63,,,63448000AE0085,,,,,,,,,,,,,0,,,,,P,prés,,,660,3.435078,45.474518
2021-1075679,2021-10-26,000001,Vente,25000,21,,RTE D'ISSOIRE,0023,63580,63448,Le Vernet-Chaméane,63,,,63448000AH0245,,,,,,,,,,,,,0,3,Dépendance,,0,S,sols,,,89,3.448792,45.473981
2021-1075679,2021-10-26,000001,Vente,25000,21,,RTE D'ISSOIRE,0023,63580,63448,Le Vernet-Chaméane,63,,,63448000AH0245,,,,,,,,,,,,,0,3,Dépendance,,0,S,sols,,,89,3.448792,45.473981
2021-1075679,2021-10-26,000001,Vente,25000,21,,RTE D'ISSOIRE,0023,63580,63448,Le Vernet-Chaméane,63,,,63448000AH0245,,,,,,,,,,,,,0,3,Dépendance,,0,S,sols,,,89,3.448792,45.473981
2021-1075722,2021-10-27,000002,Vente,250,26,,RTE DE SAINT GENES,0045,63580,63448,Le Vernet-Chaméane,63,,,63448000AH0390,,,,,,,,,,,,,0,,,,,S,sols,,,66,3.452064,45.475437
2021-1075892,2021-10-29,000001,Vente,1400,,,LE BOIS NOIR,B355,63580,63448,Le Vernet-Chaméane,63,,,63448078AC0035,,,,,,,,,,,,,0,,,,,BF,futaies feuillues,,,6210,3.425772,45.53746
2021-1075892,2021-10-29,000001,Vente,1400,,,LE BOIS NOIR,B355,63580,63448,Le Vernet-Chaméane,63,,,63448078AC0036,,,,,,,,,,,,,0,,,,,BR,futaies résineuses,,,33,3.425293,45.537933
2021-1075956,2021-10-25,000001,Vente,6000,27,,RTE DE SAINT GERMAIN,0048,63580,63448,Le Vernet-Chaméane,63,,,63448000AH0132,,,,,,,,,,,,,0,1,Maison,60,4,S,sols,,,135,3.453274,45.474278
2021-1076152,2021-11-05,000001,Vente,1800,,,SUQUET DE BEAU,B318,63580,63448,Le Vernet-Chaméane,63,,,63448000ZV0119,,,,,,,,,,,,,0,,,,,BT,taillis simples,,,2880,3.438224,45.456741
2021-1076152,2021-11-05,000001,Vente,1800,,,SUQUET DE BEAU,B318,63580,63448,Le Vernet-Chaméane,63,,,63448000ZV0119,,,,,,,,,,,,,0,,,,,BR,futaies résineuses,,,2880,3.438224,45.456741
2021-1076152,2021-11-05,000001,Vente,1800,,,SUQUET DE BEAU,B318,63580,63448,Le Vernet-Chaméane,63,,,63448000ZV0121,,,,,,,,,,,,,0,,,,,BT,taillis simples,,,425,3.438551,45.456914
2021-1076152,2021-11-05,000001,Vente,1800,,,SUQUET DE BEAU,B318,63580,63448,Le Vernet-Chaméane,63,,,63448000ZV0131,,,,,,,,,,,,,0,,,,,BT,taillis simples,,,752,3.440946,45.456341
2021-1076357,2021-10-28,000001,Vente,100700,5018,,CHAMEANE,B358,63580,63448,Le Vernet-Chaméane,63,,,63448078ZD0069,,,,,,,,,,,,,0,3,Dépendance,,0,S,sols,,,350,3.452033,45.512339
2021-1076357,2021-10-28,000001,Vente,100700,5018,,CHAMEANE,B358,63580,63448,Le Vernet-Chaméane,63,,,63448078ZD0069,,,,,,,,,,,,,0,1,Maison,100,5,J,jardins,,,1150,3.452033,45.512339
2021-1076357,2021-10-28,000001,Vente,100700,5018,,CHAMEANE,B358,63580,63448,Le Vernet-Chaméane,63,,,63448078ZD0069,,,,,,,,,,,,,0,3,Dépendance,,0,S,sols,,,350,3.452033,45.512339
2021-1076357,2021-10-28,000001,Vente,100700,5018,,CHAMEANE,B358,63580,63448,Le Vernet-Chaméane,63,,,63448078ZD0069,,,,,,,,,,,,,0,1,Maison,100,5,S,sols,,,350,3.452033,45.512339
2021-1076357,2021-10-28,000001,Vente,100700,5018,,CHAMEANE,B358,63580,63448,Le Vernet-Chaméane,63,,,63448078ZD0069,,,,,,,,,,,,,0,3,Dépendance,,0,J,jardins,,,1150,3.452033,45.512339
2021-1076357,2021-10-28,000001,Vente,100700,5018,,CHAMEANE,B358,63580,63448,Le Vernet-Chaméane,63,,,63448078ZD0069,,,,,,,,,,,,,0,3,Dépendance,,0,J,jardins,,,1150,3.452033,45.512339
2021-1076357,2021-10-28,000001,Vente,100700,5018,,CHAMEANE,B358,63580,63448,Le Vernet-Chaméane,63,,,63448078ZD0069,,,,,,,,,,,,,0,3,Dépendance,,0,J,jardins,,,1150,3.452033,45.512339
2021-1076357,2021-10-28,000001,Vente,100700,5018,,CHAMEANE,B358,63580,63448,Le Vernet-Chaméane,63,,,63448078ZD0069,,,,,,,,,,,,,0,3,Dépendance,,0,S,sols,,,350,3.452033,45.512339
2021-1077754,2021-12-06,000001,Vente,37000,5207,,LA BESSIERE,B016,63580,63448,Le Vernet-Chaméane,63,,,63448000ZY0013,,,,,,,,,,,,,0,1,Maison,78,3,S,sols,,,580,3.426703,45.474103
2021-1078416,2021-12-09,000001,Vente,100,,,LES FOSSILES,B158,63580,63448,Le Vernet-Chaméane,63,,,63448000ZD0041,,,,,,,,,,,,,0,,,,,T,terres,,,10780,3.444526,45.494609
2021-1078416,2021-12-09,000001,Vente,100,,,CHAMPS BARDS,B077,63580,63448,Le Vernet-Chaméane,63,,,63448000ZD0046,,,,,,,,,,,,,0,,,,,PA,pâtures,,,17330,3.445249,45.496964
2021-1078826,2021-12-17,000001,Vente,1200,,,MEJANET,B200,63580,63448,Le Vernet-Chaméane,63,,,63448000AM0160,,,,,,,,,,,,,0,,,,,BR,futaies résineuses,,,1075,3.414016,45.473764
2021-1078826,2021-12-17,000001,Vente,1200,,,MEJANET,B200,63580,63448,Le Vernet-Chaméane,63,,,63448000AM0167,,,,,,,,,,,,,0,,,,,BR,futaies résineuses,,,877,3.41359,45.474648
2021-1079788,2021-12-03,000001,Vente,3105,,,AUX FOURNEYRES,B161,63580,63448,Le Vernet-Chaméane,63,,,63448000YC0004,,,,,,,,,,,,,0,,,,,PA,pâtures,,,2860,3.397539,45.486682
2021-1079800,2021-12-10,000001,Vente,228000,9,,PL DE L EGLISE,0014,63580,63448,Le Vernet-Chaméane,63,,,63448000AH0075,,,,,,,,,,,,,0,3,Dépendance,,0,S,sols,,,34,3.451983,45.474848
2021-1079800,2021-12-10,000001,Vente,228000,9,,PL DE L EGLISE,0014,63580,63448,Le Vernet-Chaméane,63,,,63448000AH0075,,,,,,,,,,,,,0,3,Dépendance,,0,S,sols,,,34,3.451983,45.474848
2021-1079800,2021-12-10,000001,Vente,228000,9,,PL DE L EGLISE,0014,63580,63448,Le Vernet-Chaméane,63,,,63448000AH0076,,,,,,,,,,,,,0,,,,,S,sols,,,60,3.451892,45.47487
2021-1079800,2021-12-10,000001,Vente,228000,9,,PL DE L EGLISE,0014,63580,63448,Le Vernet-Chaméane,63,,,63448000AH0077,,,,,,,,,,,,,0,3,Dépendance,,0,S,sols,,,75,3.451806,45.474876
2021-1079800,2021-12-10,000001,Vente,228000,9,,PL DE L EGLISE,0014,63580,63448,Le Vernet-Chaméane,63,,,63448000AH0077,,,,,,,,,,,,,0,3,Dépendance,,0,S,sols,,,75,3.451806,45.474876
2021-1079800,2021-12-10,000001,Vente,228000,9,,PL DE L EGLISE,0014,63580,63448,Le Vernet-Chaméane,63,,,63448000AH0077,,,,,,,,,,,,,0,3,Dépendance,,0,S,sols,,,75,3.451806,45.474876
2021-1079800,2021-12-10,000001,Vente,228000,9,,PL DE L EGLISE,0014,63580,63448,Le Vernet-Chaméane,63,,,63448000AH0077,,,,,,,,,,,,,0,1,Maison,140,5,S,sols,,,75,3.451806,45.474876
2021-1079800,2021-12-10,000001,Vente,228000,10,,PL DE L EGLISE,0014,63580,63448,Le Vernet-Chaméane,63,,,63448000AH0079,,,,,,,,,,,,,0,1,Maison,110,4,S,sols,,,87,3.451678,45.474807
2021-1079800,2021-12-10,000001,Vente,228000,,,LE BOURG,B041,63580,63448,Le Vernet-Chaméane,63,,,63448000AH0351,,,,,,,,,,,,,0,,,,,S,sols,,,42,3.451876,45.474782
2021-1079800,2021-12-10,000001,Vente,228000,9,,PL DE L EGLISE,0014,63580,63448,Le Vernet-Chaméane,63,,,63448000AH0352,,,,,,,,,,,,,0,,,,,S,sols,,,126,3.4518,45.474792
2021-1081933,2021-01-12,000001,Vente,1600,,,CHAREL,B082,63580,63448,Le Vernet-Chaméane,63,,,63448000ZK0026,,,,,,,,,,,,,0,,,,,BR,futaies résineuses,,,4440,3.490275,45.486382
2021-1081940,2021-01-06,000001,Vente,33000,5173,,LE BOURG,B041,63580,63448,Le Vernet-Chaméane,63,,,63448000AD0126,,,32,48.66,,,,,,,,,1,1,Maison,49,3,,,,,,3.446956,45.476048
2021-1082065,2021-02-10,000001,Vente,400,,,LA COTE,B107,63580,63448,Le Vernet-Chaméane,63,,,63448000AI0077,,,,,,,,,,,,,0,,,,,BR,futaies résineuses,,,2015,3.466928,45.482746
2021-1082065,2021-02-10,000001,Vente,400,,,LA CHOTE,B096,63580,63448,Le Vernet-Chaméane,63,,,63448000AI0096,,,,,,,,,,,,,0,,,,,BR,futaies résineuses,,,1800,3.466823,45.48695
2021-1082065,2021-02-10,000001,Vente,400,,,LA BERTHE,B014,63580,63448,Le Vernet-Chaméane,63,,,63448000ZH0145,,,,,,,,,,,,,0,,,,,BR,futaies résineuses,,,950,3.461402,45.490064