id_mutation,date_mutation,numero_disposition,nature_mutation,valeur_fonciere,adresse_numero,adresse_suffixe,adresse_nom_voie,adresse_code_voie,code_postal,code_commune,nom_commune,code_departement,ancien_code_commune,ancien_nom_commune,id_parcelle,ancien_id_parcelle,numero_volume,lot1_numero,lot1_surface_carrez,lot2_numero,lot2_surface_carrez,lot3_numero,lot3_surface_carrez,lot4_numero,lot4_surface_carrez,lot5_numero,lot5_surface_carrez,nombre_lots,code_type_local,type_local,surface_reelle_bati,nombre_pieces_principales,code_nature_culture,nature_culture,code_nature_culture_speciale,nature_culture_speciale,surface_terrain,longitude,latitude
2021-1083448,2021-02-11,000001,Vente,1500,,,GERGOU,B114,64260,64127,Bielle,64,,,641270000E0167,,,,,,,,,,,,,0,,,,,L,landes,FOUG,Fougeraie,7770,-0.475081,43.05691
2021-1083634,2021-02-10,000001,Vente,85000,,,DU VILLAGE,B309,64260,64127,Bielle,64,,,641270000B0321,,,,,,,,,,,,,0,,,,,S,sols,,,18,-0.43524,43.054665
2021-1083634,2021-02-10,000001,Vente,85000,,,DU VILLAGE,B309,64260,64127,Bielle,64,,,641270000B0321,,,,,,,,,,,,,0,,,,,J,jardins,,,540,-0.43524,43.054665
2021-1083634,2021-02-10,000001,Vente,85000,10,,RUE D ASPEIGT,0105,64260,64127,Bielle,64,,,641270000B0322,,,,,,,,,,,,,0,1,Maison,76,2,S,sols,,,222,-0.435254,43.054532
2021-1085552,2021-05-07,000001,Vente,48000,4,,ALL DES PLATANES,0400,64260,64127,Bielle,64,,,641270000B0901,,,,,,,,,,,,,0,,,,,AB,terrains a bâtir,,,746,-0.430027,43.051818
2021-1087355,2021-06-16,000001,Vente,69400,,,RUE DE L ECOLE,0210,64260,64127,Bielle,64,,,641270000A0946,,,,,,,,,,,,,0,1,Maison,50,2,S,sols,,,37,-0.431021,43.056246
2021-1088619,2021-08-19,000001,Vente,120000,27,,RUE D ASPEIGT,0105,64260,64127,Bielle,64,,,641270000C0019,,,,,,,,,,,,,0,1,Maison,150,5,S,sols,,,480,-0.440046,43.055535
2021-1089463,2021-09-08,000001,Vente,600,9580,,IMP DU VILLAGE VACANCES,0475,64260,64127,Bielle,64,,,641270000B0580,,,,,,,,,,,,,0,3,Dépendance,,0,S,sols,,,36,-0.428875,43.055082
2021-1089675,2021-09-09,000001,Vente,180000,,,DU BOIS DU BOILA,B041,64260,64127,Bielle,64,,,641270000C0025,,,,,,,,,,,,,0,,,,,E,eaux,CANAL,Canal,38,-0.440555,43.055874
2021-1089675,2021-09-09,000001,Vente,180000,4,,IMP DU BOURDALAT,0146,64260,64127,Bielle,64,,,641270000C0026,,,,,,,,,,,,,0,1,Maison,140,6,S,sols,,,1070,-0.440709,43.05583
2021-1089675,2021-09-09,000001,Vente,180000,4,,IMP DU BOURDALAT,0146,64260,64127,Bielle,64,,,641270000C0026,,,,,,,,,,,,,0,3,Dépendance,,0,S,sols,,,1070,-0.440709,43.05583
2021-1089675,2021-09-09,000001,Vente,180000,,,DU BOIS DU BOILA,B041,64260,64127,Bielle,64,,,641270000C0112,,,,,,,,,,,,,0,,,,,T,terres,,,712,-0.440244,43.055773
2021-1091773,2021-11-18,000001,Vente,159000,4,,RUE D ASPEIGT,0105,64260,64127,Bielle,64,,,641270000B0317,,,,,,,,,,,,,0,3,Dépendance,,0,S,sols,,,675,-0.434764,43.054522
2021-1091773,2021-11-18,000001,Vente,159000,4,,RUE D ASPEIGT,0105,64260,64127,Bielle,64,,,641270000B0317,,,,,,,,,,,,,0,2,Appartement,110,4,S,sols,,,675,-0.434764,43.054522
2021-1091773,2021-11-18,000001,Vente,159000,4,,RUE D ASPEIGT,0105,64260,64127,Bielle,64,,,641270000B0317,,,,,,,,,,,,,0,2,Appartement,104,4,S,sols,,,675,-0.434764,43.054522
