id_mutation,date_mutation,numero_disposition,nature_mutation,valeur_fonciere,adresse_numero,adresse_suffixe,adresse_nom_voie,adresse_code_voie,code_postal,code_commune,nom_commune,code_departement,ancien_code_commune,ancien_nom_commune,id_parcelle,ancien_id_parcelle,numero_volume,lot1_numero,lot1_surface_carrez,lot2_numero,lot2_surface_carrez,lot3_numero,lot3_surface_carrez,lot4_numero,lot4_surface_carrez,lot5_numero,lot5_surface_carrez,nombre_lots,code_type_local,type_local,surface_reelle_bati,nombre_pieces_principales,code_nature_culture,nature_culture,code_nature_culture_speciale,nature_culture_speciale,surface_terrain,longitude,latitude
2021-1082580,2021-01-11,000001,Vente,214500,15,,RUE DU PIC DU MIDI,0198,64420,64216,Espoey,64,,,64216000ZI0214,,,,,,,,,,,,,0,1,Maison,96,4,S,sols,,,951,-0.159937,43.243167
2021-1082742,2021-01-15,000001,Vente,54000,13,,CHE TOUSTET,0225,64420,64216,Espoey,64,,,642160000E0664,,,,,,,,,,,,,0,,,,,BF,futaies feuillues,CHENE,Chênes,286,-0.154738,43.238307
2021-1082742,2021-01-15,000001,Vente,54000,,,POUMADERE,B282,64420,64216,Espoey,64,,,642160000E0666,,,,,,,,,,,,,0,,,,,AB,terrains a bâtir,,,1327,-0.154673,43.238493
2021-1082785,2021-01-12,000001,Vente,180000,43,,CHE DU PLATEAU,0200,64420,64216,Espoey,64,,,64216000ZD0033,,,,,,,,,,,,,0,1,Maison,104,5,AG,terrains d'agrément,,,800,-0.157236,43.257908
2021-1082785,2021-01-12,000001,Vente,180000,43,,CHE DU PLATEAU,0200,64420,64216,Espoey,64,,,64216000ZD0033,,,,,,,,,,,,,0,1,Maison,104,5,S,sols,,,580,-0.157236,43.257908
2021-1082785,2021-01-12,000001,Vente,180000,,,HOURCQ PETIT,B185,64420,64216,Espoey,64,,,64216000ZD0069,,,,,,,,,,,,,0,,,,,AB,terrains a bâtir,,,301,-0.157209,43.258096
2021-1084166,2021-03-17,000002,Echange,3000,,,BISTOR,B054,64420,64216,Espoey,64,,,64216000ZN0315,,,,,,,,,,,,,0,,,,,AB,terrains a bâtir,,,262,-0.1704,43.256327
2021-1084166,2021-03-17,000003,Echange,3000,,,BISTOR,B054,64420,64216,Espoey,64,,,64216000ZN0316,,,,,,,,,,,,,0,,,,,T,terres,,,108,-0.170705,43.256388
2021-1084166,2021-03-17,000003,Echange,3000,,,BISTOR,B054,64420,64216,Espoey,64,,,64216000ZN0317,,,,,,,,,,,,,0,,,,,T,terres,,,91,-0.171038,43.25621
2021-1084216,2021-03-17,000001,Vente,233000,,,POUMADERE,B282,64420,64216,Espoey,64,,,642160000E0583,,,,,,,,,,,,,0,,,,,BF,futaies feuillues,CHENE,Chênes,16,-0.154159,43.238172
2021-1084216,2021-03-17,000001,Vente,233000,,,POUMADERE,B282,64420,64216,Espoey,64,,,642160000E0585,,,,,,,,,,,,,0,,,,,T,terres,,,87,-0.154058,43.238424
2021-1084216,2021-03-17,000001,Vente,233000,17,,CHE TOUSTET,0225,64420,64216,Espoey,64,,,642160000E0590,,,,,,,,,,,,,0,1,Maison,110,5,J,jardins,,,195,-0.153937,43.238318
2021-1084216,2021-03-17,000001,Vente,233000,17,,CHE TOUSTET,0225,64420,64216,Espoey,64,,,642160000E0590,,,,,,,,,,,,,0,1,Maison,110,5,S,sols,,,650,-0.153937,43.238318
2021-1084216,2021-03-17,000001,Vente,233000,17,,CHE TOUSTET,0225,64420,64216,Espoey,64,,,642160000E0590,,,,,,,,,,,,,0,1,Maison,110,5,T,terres,,,320,-0.153937,43.238318
2021-1084216,2021-03-17,000001,Vente,233000,17,,CHE TOUSTET,0225,64420,64216,Espoey,64,,,642160000E0590,,,,,,,,,,,,,0,1,Maison,110,5,VE,vergers,,,482,-0.153937,43.238318
2021-1084535,2021-03-17,000001,Vente,37500,,,BISTOR,B054,64420,64216,Espoey,64,,,64216000ZN0313,,,,,,,,,,,,,0,,,,,AB,terrains a bâtir,,,1152,-0.170809,43.25598
2021-1084535,2021-03-17,000001,Vente,37500,,,BISTOR,B054,64420,64216,Espoey,64,,,64216000ZN0317,,,,,,,,,,,,,0,,,,,T,terres,,,91,-0.171038,43.25621
2021-1084596,2021-03-25,000001,Vente,59469,,,CASSOURAT ET ROUMIGUES,B100,64420,64216,Espoey,64,,,64216000ZN0083,,,,,,,,,,,,,0,,,,,T,terres,,,13000,-0.177594,43.25423
2021-1084596,2021-03-25,000001,Vente,59469,,,CASSOURAT ET ROUMIGUES,B100,64420,64216,Espoey,64,,,64216000ZN0083,,,,,,,,,,,,,0,,,,,T,terres,,,33160,-0.177594,43.25423
2021-1084596,2021-03-25,000001,Vente,59469,,,CASSOURAT ET ROUMIGUES,B100,64420,64216,Espoey,64,,,64216000ZN0259,,,,,,,,,,,,,0,,,,,T,terres,,,13309,-0.178754,43.253755
2021-1085139,2021-04-16,000001,Vente,50000,2,,CHE TOUSTET,0225,64420,64216,Espoey,64,,,642160000E0646,,,,,,,,,,,,,0,,,,,AB,terrains a bâtir,,,1431,-0.156478,43.237334
2021-1085143,2021-04-06,000002,Vente,45000,16,,RUE PHILIPPE DESBORDES,0197,64420,64216,Espoey,64,,,642160000E0669,,,,,,,,,,,,,0,,,,,T,terres,,,801,-0.163469,43.240101
2021-1085496,2021-05-12,000001,Vente,90000,17,,RUE LA CARRERASSE,0030,64420,64216,Espoey,64,,,642160000F0408,,,,,,,,,,,,,0,,,,,J,jardins,,,380,-0.166298,43.244819
2021-1085496,2021-05-12,000001,Vente,90000,17,,RUE LA CARRERASSE,0030,64420,64216,Espoey,64,,,642160000F0409,,,,,,,,,,,,,0,3,Dépendance,,0,S,sols,,,370,-0.166333,43.244701
2021-1085496,2021-05-12,000001,Vente,90000,17,,RUE LA CARRERASSE,0030,64420,64216,Espoey,64,,,642160000F0409,,,,,,,,,,,,,0,3,Dépendance,,0,S,sols,,,370,-0.166333,43.244701
2021-1085496,2021-05-12,000001,Vente,90000,17,,RUE LA CARRERASSE,0030,64420,64216,Espoey,64,,,642160000F0409,,,,,,,,,,,,,0,1,Maison,96,3,S,sols,,,370,-0.166333,43.244701
2021-1086042,2021-05-26,000001,Vente,50000,16,,RUE PHILIPPE DESBORDES,0197,64420,64216,Espoey,64,,,642160000E0670,,,,,,,,,,,,,0,,,,,AB,terrains a bâtir,,,2699,-0.163712,43.239813
2021-1086391,2021-05-26,000001,Vente,120000,17,,RUE PHILIPPE DESBORDES,0197,64420,64216,Espoey,64,,,642160000E0541,,,18,64.11,41,,,,,,,,2,3,Dépendance,,0,,,,,,-0.162705,43.240125
2021-1086391,2021-05-26,000001,Vente,120000,17,,RUE PHILIPPE DESBORDES,0197,64420,64216,Espoey,64,,,642160000E0541,,,18,64.11,41,,,,,,,,2,2,Appartement,63,3,,,,,,-0.162705,43.240125
2021-1087175,2021-06-28,000001,Vente,39500,,,BISTOR,B054,64420,64216,Espoey,64,,,64216000ZN0314,,,,,,,,,,,,,0,,,,,AB,terrains a bâtir,,,1136,-0.170574,43.256257
2021-1087175,2021-06-28,000001,Vente,39500,,,BISTOR,B054,64420,64216,Espoey,64,,,64216000ZN0316,,,,,,,,,,,,,0,,,,,T,terres,,,108,-0.170705,43.256388
2021-1087190,2021-06-23,000001,Vente,62000,,,BISTOR,B054,64420,64216,Espoey,64,,,64216000ZN0315,,,,,,,,,,,,,0,,,,,AB,terrains a bâtir,,,262,-0.1704,43.256327
2021-1087190,2021-06-23,000001,Vente,62000,,,BISTOR,B054,64420,64216,Espoey,64,,,64216000ZN0318,,,,,,,,,,,,,0,,,,,AB,terrains a bâtir,,,2275,-0.170899,43.256452
2021-1087190,2021-06-23,000001,Vente,62000,,,BISTOR,B054,64420,64216,Espoey,64,,,64216000ZN0319,,,,,,,,,,,,,0,,,,,T,terres,,,350,-0.171215,43.256588
2021-1087193,2021-06-30,000001,Vente,381900,29,,CHE DE LARRECQ,0090,64420,64216,Espoey,64,,,642160000B0113,,,,,,,,,,,,,0,,,,,VE,vergers,,,1345,-0.168955,43.257659
2021-1087193,2021-06-30,000001,Vente,381900,,,BISTOR,B054,64420,64216,Espoey,64,,,642160000B0115,,,,,,,,,,,,,0,,,,,P,prés,,,2508,-0.169173,43.2574
2021-1087193,2021-06-30,000001,Vente,381900,,,BISTOR,B054,64420,64216,Espoey,64,,,642160000B0116,,,,,,,,,,,,,0,,,,,VE,vergers,,,330,-0.16946,43.257197
2021-1087193,2021-06-30,000001,Vente,381900,5114,,CHE DE LARRECQ,0090,64420,64216,Espoey,64,,,642160000B0904,,,,,,,,,,,,,0,,,,,S,sols,,,50,-0.169149,43.25762
2021-1087193,2021-06-30,000001,Vente,381900,29,,CHE DE LARRECQ,0090,64420,64216,Espoey,64,,,642160000B0905,,,,,,,,,,,,,0,3,Dépendance,,0,S,sols,,,117,-0.169098,43.257454
2021-1087193,2021-06-30,000001,Vente,381900,29,,CHE DE LARRECQ,0090,64420,64216,Espoey,64,,,642160000B0905,,,,,,,,,,,,,0,3,Dépendance,,0,S,sols,,,117,-0.169098,43.257454
2021-1087193,2021-06-30,000001,Vente,381900,29,,CHE DE LARRECQ,0090,64420,64216,Espoey,64,,,642160000B0905,,,,,,,,,,,,,0,1,Maison,205,6,S,sols,,,117,-0.169098,43.257454
2021-1087910,2021-07-27,000001,Vente,315491,,,TOUYAS DESSUS ET PEYRAUBE,B322,64420,64216,Espoey,64,,,642160000B0560,,,,,,,,,,,,,0,,,,,BT,taillis simples,,,180,-0.15284,43.248043
2021-1087910,2021-07-27,000001,Vente,315491,4,,CHE DE PEYRAUBE,0194,64420,64216,Espoey,64,,,642160000B0805,,,,,,,,,,,,,0,3,Dépendance,,0,T,terres,,,1292,-0.152647,43.248541
2021-1087910,2021-07-27,000001,Vente,315491,4,,CHE DE PEYRAUBE,0194,64420,64216,Espoey,64,,,642160000B0805,,,,,,,,,,,,,0,1,Maison,101,4,T,terres,,,1292,-0.152647,43.248541
2021-1087910,2021-07-27,000001,Vente,315491,,,TOUYAS DESSUS ET PEYRAUBE,B322,64420,64216,Espoey,64,,,642160000B0807,,,,,,,,,,,,,0,,,,,S,sols,,,21,-0.152458,43.248043
2021-1087910,2021-07-27,000001,Vente,315491,5809,,CHE DE PEYRAUBE,0194,64420,64216,Espoey,64,,,642160000B0809,,,,,,,,,,,,,0,,,,,AG,terrains d'agrément,,,1500,-0.152759,43.248195
2021-1087910,2021-07-27,000001,Vente,315491,5809,,CHE DE PEYRAUBE,0194,64420,64216,Espoey,64,,,642160000B0809,,,,,,,,,,,,,0,,,,,S,sols,,,693,-0.152759,43.248195
2021-1088182,2021-07-15,000001,Vente,214500,10,,CHE TOUSTET,0225,64420,64216,Espoey,64,,,642160000E0600,,,,,,,,,,,,,0,3,Dépendance,,0,S,sols,,,1034,-0.155103,43.237583
2021-1088182,2021-07-15,000001,Vente,214500,10,,CHE TOUSTET,0225,64420,64216,Espoey,64,,,642160000E0600,,,,,,,,,,,,,0,1,Maison,90,4,J,jardins,,,803,-0.155103,43.237583
2021-1088182,2021-07-15,000001,Vente,214500,10,,CHE TOUSTET,0225,64420,64216,Espoey,64,,,642160000E0600,,,,,,,,,,,,,0,3,Dépendance,,0,J,jardins,,,803,-0.155103,43.237583
2021-1088182,2021-07-15,000001,Vente,214500,10,,CHE TOUSTET,0225,64420,64216,Espoey,64,,,642160000E0600,,,,,,,,,,,,,0,1,Maison,90,4,S,sols,,,1034,-0.155103,43.237583
2021-1088300,2021-07-26,000001,Vente,88840,,,TROUNDES DE BACH,B327,64420,64216,Espoey,64,,,64216000ZC0077,,,,,,,,,,,,,0,,,,,T,terres,,,39507,-0.142534,43.26922
2021-1088300,2021-07-26,000001,Vente,88840,,,TROUNDES DE BACH,B327,64420,64216,Espoey,64,,,64216000ZC0078,,,,,,,,,,,,,0,,,,,T,terres,,,17809,-0.143303,43.270014
2021-1088612,2021-08-04,000001,Vente,205000,22,,CHE DE LARRECQ,0090,64420,64216,Espoey,64,,,64216000ZN0262,,,,,,,,,,,,,0,,,,,AB,terrains a bâtir,,,1521,-0.171415,43.255336
2021-1088613,2021-07-30,000001,Vente,135000,17,,RUE PHILIPPE DESBORDES,0197,64420,64216,Espoey,64,,,642160000E0541,,,21,91.69,35,,,,,,,,2,2,Appartement,87,4,,,,,,-0.162705,43.240125
2021-1088613,2021-07-30,000001,Vente,135000,17,,RUE PHILIPPE DESBORDES,0197,64420,64216,Espoey,64,,,642160000E0541,,,21,91.69,35,,,,,,,,2,3,Dépendance,,0,,,,,,-0.162705,43.240125
2021-1088893,2021-08-30,000001,Vente,307600,4,,CHE TOUSTET,0225,64420,64216,Espoey,64,,,642160000E0588,,,,,,,,,,,,,0,1,Maison,154,8,AG,terrains d'agrément,,,1500,-0.155914,43.237541
2021-1088893,2021-08-30,000001,Vente,307600,4,,CHE TOUSTET,0225,64420,64216,Espoey,64,,,642160000E0588,,,,,,,,,,,,,0,1,Maison,154,8,S,sols,,,1500,-0.155914,43.237541
2021-1089073,2021-08-17,000001,Vente,45000,,,HOURCQ PETIT,B185,64420,64216,Espoey,64,,,64216000ZD0117,,,,,,,,,,,,,0,,,,,AB,terrains a bâtir,,,1179,-0.160502,43.256083
2021-1089173,2021-08-31,000001,Vente,55000,15,,CHE TOUSTET,0225,64420,64216,Espoey,64,,,642160000E0665,,,,,,,,,,,,,0,,,,,AB,terrains a bâtir,,,269,-0.154387,43.238226
2021-1089173,2021-08-31,000001,Vente,55000,15,,CHE TOUSTET,0225,64420,64216,Espoey,64,,,642160000E0667,,,,,,,,,,,,,0,,,,,AB,terrains a bâtir,,,1344,-0.154316,43.238407
2021-1089356,2021-08-21,000001,Vente,215000,5,,RUE DU BOURG NEUF,0021,64420,64216,Espoey,64,,,642160000F0774,,,,,,,,,,,,,0,1,Maison,108,4,S,sols,,,1040,-0.163117,43.246298
2021-1089356,2021-08-21,000001,Vente,215000,5,,RUE DU BOURG NEUF,0021,64420,64216,Espoey,64,,,642160000F0774,,,,,,,,,,,,,0,3,Dépendance,,0,S,sols,,,1040,-0.163117,43.246298
2021-1089716,2021-08-13,000001,Vente,117000,17,,RUE PHILIPPE DESBORDES,0197,64420,64216,Espoey,64,,,642160000E0541,,,15,,39,,,,,,,,2,2,Appartement,85,4,,,,,,-0.162705,43.240125
2021-1089716,2021-08-13,000001,Vente,117000,17,,RUE PHILIPPE DESBORDES,0197,64420,64216,Espoey,64,,,642160000E0541,,,15,,39,,,,,,,,2,3,Dépendance,,0,,,,,,-0.162705,43.240125
2021-1089729,2021-09-24,000001,Vente,333390,6,,CHE DE JANVIER,0085,64420,64216,Espoey,64,,,64216000ZN0177,,,,,,,,,,,,,0,1,Maison,234,7,BT,taillis simples,,,1660,-0.167925,43.256163
2021-1089729,2021-09-24,000001,Vente,333390,6,,CHE DE JANVIER,0085,64420,64216,Espoey,64,,,64216000ZN0177,,,,,,,,,,,,,0,3,Dépendance,,0,S,sols,,,1643,-0.167925,43.256163
2021-1089729,2021-09-24,000001,Vente,333390,6,,CHE DE JANVIER,0085,64420,64216,Espoey,64,,,64216000ZN0177,,,,,,,,,,,,,0,1,Maison,234,7,S,sols,,,1643,-0.167925,43.256163
2021-1089729,2021-09-24,000001,Vente,333390,6,,CHE DE JANVIER,0085,64420,64216,Espoey,64,,,64216000ZN0177,,,,,,,,,,,,,0,3,Dépendance,,0,S,sols,,,1643,-0.167925,43.256163
2021-1089729,2021-09-24,000001,Vente,333390,6,,CHE DE JANVIER,0085,64420,64216,Espoey,64,,,64216000ZN0177,,,,,,,,,,,,,0,3,Dépendance,,0,S,sols,,,1643,-0.167925,43.256163
2021-1089729,2021-09-24,000001,Vente,333390,6,,CHE DE JANVIER,0085,64420,64216,Espoey,64,,,64216000ZN0177,,,,,,,,,,,,,0,3,Dépendance,,0,BT,taillis simples,,,1660,-0.167925,43.256163
2021-1089729,2021-09-24,000001,Vente,333390,6,,CHE DE JANVIER,0085,64420,64216,Espoey,64,,,64216000ZN0177,,,,,,,,,,,,,0,3,Dépendance,,0,S,sols,,,1643,-0.167925,43.256163
2021-1089729,2021-09-24,000001,Vente,333390,6,,CHE DE JANVIER,0085,64420,64216,Espoey,64,,,64216000ZN0177,,,,,,,,,,,,,0,3,Dépendance,,0,BT,taillis simples,,,1660,-0.167925,43.256163
2021-1089729,2021-09-24,000001,Vente,333390,6,,CHE DE JANVIER,0085,64420,64216,Espoey,64,,,64216000ZN0177,,,,,,,,,,,,,0,3,Dépendance,,0,BT,taillis simples,,,1660,-0.167925,43.256163
2021-1089729,2021-09-24,000001,Vente,333390,6,,CHE DE JANVIER,0085,64420,64216,Espoey,64,,,64216000ZN0177,,,,,,,,,,,,,0,3,Dépendance,,0,BT,taillis simples,,,1660,-0.167925,43.256163
2021-1090366,2021-09-29,000001,Vente,10000,,,MARQUE DESSUS,B225,64420,64216,Espoey,64,,,642160000F0560,,,,,,,,,,,,,0,,,,,T,terres,,,3785,-0.169956,43.243705
2021-1090366,2021-09-29,000001,Vente,10000,,,MARQUE DESSUS,B225,64420,64216,Espoey,64,,,642160000F0560,,,,,,,,,,,,,0,,,,,T,terres,,,3785,-0.169956,43.243705
2021-1090570,2021-10-04,000001,Vente,150000,20,,RTE DE LOURDES,0130,64420,64216,Espoey,64,,,64216000ZN0008,,,,,,,,,,,,,0,3,Dépendance,,0,S,sols,,,1000,-0.176971,43.257165
2021-1090570,2021-10-04,000001,Vente,150000,20,,RTE DE LOURDES,0130,64420,64216,Espoey,64,,,64216000ZN0008,,,,,,,,,,,,,0,2,Appartement,88,3,S,sols,,,1000,-0.176971,43.257165
2021-1090570,2021-10-04,000001,Vente,150000,20,,RTE DE LOURDES,0130,64420,64216,Espoey,64,,,64216000ZN0008,,,,,,,,,,,,,0,2,Appartement,88,3,AG,terrains d'agrément,,,2340,-0.176971,43.257165
2021-1090570,2021-10-04,000001,Vente,150000,20,,RTE DE LOURDES,0130,64420,64216,Espoey,64,,,64216000ZN0008,,,,,,,,,,,,,0,2,Appartement,88,4,S,sols,,,1000,-0.176971,43.257165
2021-1090570,2021-10-04,000001,Vente,150000,20,,RTE DE LOURDES,0130,64420,64216,Espoey,64,,,64216000ZN0008,,,,,,,,,,,,,0,2,Appartement,88,4,AG,terrains d'agrément,,,2340,-0.176971,43.257165
2021-1090570,2021-10-04,000001,Vente,150000,20,,RTE DE LOURDES,0130,64420,64216,Espoey,64,,,64216000ZN0008,,,,,,,,,,,,,0,3,Dépendance,,0,AG,terrains d'agrément,,,2340,-0.176971,43.257165
2021-1090590,2021-09-27,000001,Vente,1500,26,,CHE DES ARTIGAUS,0010,64420,64216,Espoey,64,,,642160000F0064,,,,,,,,,,,,,0,,,,,T,terres,,,2470,-0.170603,43.250343
2021-1091472,2021-11-16,000001,Vente,50000,2,,CHE TOUSTET,0225,64420,64216,Espoey,64,,,642160000E0647,,,,,,,,,,,,,0,,,,,AB,terrains a bâtir,,,1432,-0.156286,43.237281
2021-1091797,2021-11-30,000002,Vente,43000,10,,IMP AMONCAUTS,0008,64420,64216,Espoey,64,,,64216000ZL0134,,,,,,,,,,,,,0,,,,,T,terres,,,161,,
2021-1091797,2021-11-30,000002,Vente,43000,10,,IMP AMONCAUTS,0008,64420,64216,Espoey,64,,,64216000ZL0135,,,,,,,,,,,,,0,,,,,T,terres,,,1200,-0.171454,43.241587
2021-1091991,2021-12-07,000001,Vente,183000,5,,IMP AMONCAUTS,0008,64420,64216,Espoey,64,,,64216000ZL0138,,,,,,,,,,,,,0,1,Maison,90,5,S,sols,,,2108,-0.171288,43.239891
2021-1092218,2021-12-06,000001,Vente,256800,7,,RTE DU BISTOR,0018,64420,64216,Espoey,64,,,64216000ZN0304,,,,,,,,,,,,,0,1,Maison,114,3,S,sols,,,800,-0.162084,43.260044
2021-1092218,2021-12-06,000001,Vente,256800,7,,RTE DU BISTOR,0018,64420,64216,Espoey,64,,,64216000ZN0304,,,,,,,,,,,,,0,1,Maison,114,3,AG,terrains d'agrément,,,924,-0.162084,43.260044
2021-1092352,2021-12-22,000001,Vente,133000,2,,CHE DE JANVIER,0085,64420,64216,Espoey,64,,,64216000ZN0330,,,,,,,,,,,,,0,,,,,T,terres,,,2458,-0.166346,43.254411
2021-1092352,2021-12-22,000001,Vente,133000,2,,CHE DE JANVIER,0085,64420,64216,Espoey,64,,,64216000ZN0331,,,,,,,,,,,,,0,,,,,T,terres,,,3072,-0.166153,43.253915
2021-1092452,2021-12-07,000001,Vente,86758,1,,RTE DE LOURDES,0130,64420,64216,Espoey,64,,,64216000ZM0010,,,,,,,,,,,,,0,3,Dépendance,,0,S,sols,,,600,-0.173863,43.251296
2021-1092452,2021-12-07,000001,Vente,86758,1,,RTE DE LOURDES,0130,64420,64216,Espoey,64,,,64216000ZM0010,,,,,,,,,,,,,0,1,Maison,86,4,AG,terrains d'agrément,,,1000,-0.173863,43.251296
2021-1092452,2021-12-07,000001,Vente,86758,1,,RTE DE LOURDES,0130,64420,64216,Espoey,64,,,64216000ZM0010,,,,,,,,,,,,,0,1,Maison,86,4,S,sols,,,600,-0.173863,43.251296
2021-1092452,2021-12-07,000001,Vente,86758,1,,RTE DE LOURDES,0130,64420,64216,Espoey,64,,,64216000ZM0010,,,,,,,,,,,,,0,3,Dépendance,,0,AG,terrains d'agrément,,,1000,-0.173863,43.251296
