id_mutation,date_mutation,numero_disposition,nature_mutation,valeur_fonciere,adresse_numero,adresse_suffixe,adresse_nom_voie,adresse_code_voie,code_postal,code_commune,nom_commune,code_departement,ancien_code_commune,ancien_nom_commune,id_parcelle,ancien_id_parcelle,numero_volume,lot1_numero,lot1_surface_carrez,lot2_numero,lot2_surface_carrez,lot3_numero,lot3_surface_carrez,lot4_numero,lot4_surface_carrez,lot5_numero,lot5_surface_carrez,nombre_lots,code_type_local,type_local,surface_reelle_bati,nombre_pieces_principales,code_nature_culture,nature_culture,code_nature_culture_speciale,nature_culture_speciale,surface_terrain,longitude,latitude
2021-1093354,2021-01-07,000001,Vente,65000,,,ERDOICE,B065,64780,64273,Irissarry,64,,,642730000G0548,,,,,,,,,,,,,0,,,,,AB,terrains a bâtir,,,736,-1.224931,43.255378
2021-1094360,2021-03-04,000002,Echange,900,,,CELHAY,B040,64780,64273,Irissarry,64,,,64273000AC0265,,,,,,,,,,,,,0,,,,,P,prés,,,370,-1.227702,43.259375
2021-1094360,2021-03-04,000002,Echange,900,,,CELHAY,B040,64780,64273,Irissarry,64,,,64273000AC0270,,,,,,,,,,,,,0,,,,,P,prés,,,1027,-1.227396,43.259339
2021-1094360,2021-03-04,000003,Echange,900,,,CELHAY,B040,64780,64273,Irissarry,64,,,64273000AC0266,,,,,,,,,,,,,0,,,,,P,prés,,,1397,-1.22727,43.259704
2021-1094630,2021-03-04,000001,Vente,171700,7248,,AIRAMENDIA,B005,64780,64273,Irissarry,64,,,642730000D0248,,,,,,,,,,,,,0,1,Maison,140,6,S,sols,,,88,-1.218609,43.254871
2021-1094630,2021-03-04,000001,Vente,171700,,,AIRAMENDIA,B005,64780,64273,Irissarry,64,,,642730000D0249,,,,,,,,,,,,,0,,,,,J,jardins,,,447,-1.218688,43.254818
2021-1094630,2021-03-04,000001,Vente,171700,,,AIRAMENDIA,B005,64780,64273,Irissarry,64,,,642730000D0423,,,,,,,,,,,,,0,,,,,P,prés,,,399,-1.218917,43.254482
2021-1094630,2021-03-04,000001,Vente,171700,,,AIRAMENDIA,B005,64780,64273,Irissarry,64,,,642730000D0425,,,,,,,,,,,,,0,,,,,L,landes,TOUYA,Touyas,1481,-1.218679,43.254808
2021-1095110,2021-03-12,000003,Vente,75000,,,CHARBONEKOALDIA,B048,64780,64273,Irissarry,64,,,642730000C0743,,,,,,,,,,,,,0,,,,,P,prés,,,914,-1.235834,43.277005
2021-1095110,2021-03-12,000003,Vente,75000,,,CHARBONEKOALDIA,B048,64780,64273,Irissarry,64,,,642730000C0745,,,,,,,,,,,,,0,,,,,P,prés,,,779,-1.235616,43.27675
2021-1095587,2021-03-31,000001,Echange,35000,,,KARRIKARTEKOALDIA,B094,64780,64273,Irissarry,64,,,642730000C0727,,,,,,,,,,,,,0,,,,,S,sols,,,1000,-1.221142,43.266443
2021-1095587,2021-03-31,000002,Echange,35000,,,ERDOICE,B065,64780,64273,Irissarry,64,,,642730000G0562,,,,,,,,,,,,,0,,,,,AB,terrains a bâtir,,,1181,-1.225652,43.253753
2021-1096261,2021-05-03,000001,Vente,325800,5236,,CELHAY,B040,64780,64273,Irissarry,64,,,64273000AC0154,,,,,,,,,,,,,0,1,Maison,120,4,S,sols,,,1054,-1.224987,43.257468
2021-1096379,2021-04-30,000001,Vente,67375,,,ERDOICE,B065,64780,64273,Irissarry,64,,,642730000G0523,,,,,,,,,,,,,0,,,,,AB,terrains a bâtir,,,45,-1.226139,43.254314
2021-1096379,2021-04-30,000001,Vente,67375,,,ERDOICE,B065,64780,64273,Irissarry,64,,,642730000G0524,,,,,,,,,,,,,0,,,,,AB,terrains a bâtir,,,1880,-1.226111,43.254151
2021-1097483,2021-06-11,000002,Vente,457655,,,CELHAY,B040,64780,64273,Irissarry,64,,,64273000AC0025,,,,,,,,,,,,,0,,,,,VE,vergers,,,228,-1.223755,43.259962
2021-1097483,2021-06-11,000002,Vente,457655,,,CELHAY,B040,64780,64273,Irissarry,64,,,64273000AC0026,,,,,,,,,,,,,0,,,,,J,jardins,,,537,-1.22405,43.26008
2021-1097483,2021-06-11,000002,Vente,457655,,,CELHAY,B040,64780,64273,Irissarry,64,,,64273000AC0029,,,,,,,,,,,,,0,,,,,S,sols,,,770,-1.224991,43.260129
2021-1097483,2021-06-11,000002,Vente,457655,,,CELHAY,B040,64780,64273,Irissarry,64,,,64273000AC0030,,,,,,,,,,,,,0,,,,,P,prés,,,98,-1.224948,43.259987
2021-1097483,2021-06-11,000002,Vente,457655,,,CELHAY,B040,64780,64273,Irissarry,64,,,64273000AC0145,,,,,,,,,,,,,0,,,,,J,jardins,,,35,-1.22467,43.258936
2021-1097483,2021-06-11,000002,Vente,457655,,,CELHAY,B040,64780,64273,Irissarry,64,,,64273000AC0236,,,,,,,,,,,,,0,,,,,P,prés,,,130,-1.223854,43.25984
2021-1097483,2021-06-11,000002,Vente,457655,,,CELHAY,B040,64780,64273,Irissarry,64,,,64273000AC0237,,,,,,,,,,,,,0,,,,,P,prés,,,1033,-1.224385,43.260064
2021-1097483,2021-06-11,000002,Vente,457655,,,CELHAY,B040,64780,64273,Irissarry,64,,,64273000AC0238,,,,,,,,,,,,,0,,,,,P,prés,,,940,-1.22451,43.259943
2021-1097483,2021-06-11,000002,Vente,457655,,,CELHAY,B040,64780,64273,Irissarry,64,,,64273000AC0239,,,,,,,,,,,,,0,,,,,P,prés,,,4778,-1.224284,43.259328
2021-1097483,2021-06-11,000002,Vente,457655,,,CELHAY,B040,64780,64273,Irissarry,64,,,64273000AC0240,,,,,,,,,,,,,0,,,,,T,terres,,,254,-1.224927,43.259874
2021-1097483,2021-06-11,000002,Vente,457655,,,CELHAY,B040,64780,64273,Irissarry,64,,,64273000AC0241,,,,,,,,,,,,,0,,,,,T,terres,,,2232,-1.224818,43.259298
2021-1097483,2021-06-11,000002,Vente,457655,,,CELHAY,B040,64780,64273,Irissarry,64,,,64273000AC0281,,,,,,,,,,,,,0,,,,,S,sols,,,278,-1.224762,43.260416
2021-1097483,2021-06-11,000002,Vente,457655,,,CELHAY,B040,64780,64273,Irissarry,64,,,64273000AC0282,,,,,,,,,,,,,0,,,,,S,sols,,,379,-1.224683,43.260316
2021-1097483,2021-06-11,000002,Vente,457655,5079,,CELHAY,B040,64780,64273,Irissarry,64,,,64273000AC0283,,,,,,,,,,,,,0,2,Appartement,330,9,S,sols,,,704,-1.22449,43.260161
2021-1097483,2021-06-11,000002,Vente,457655,5079,,CELHAY,B040,64780,64273,Irissarry,64,,,64273000AC0283,,,,,,,,,,,,,0,2,Appartement,110,3,S,sols,,,704,-1.22449,43.260161
2021-1097483,2021-06-11,000002,Vente,457655,5079,,CELHAY,B040,64780,64273,Irissarry,64,,,64273000AC0283,,,,,,,,,,,,,0,3,Dépendance,,0,S,sols,,,704,-1.22449,43.260161
2021-1099421,2021-08-11,000001,Vente,158000,5029,,LA PLACE,B115,64780,64273,Irissarry,64,,,64273000AB0156,,,,,,,,,,,,,0,1,Maison,185,7,S,sols,,,272,-1.23279,43.256721
2021-1099421,2021-08-11,000001,Vente,158000,,,LA PLACE,B115,64780,64273,Irissarry,64,,,64273000AB0160,,,,,,,,,,,,,0,,,,,S,sols,,,115,-1.233043,43.256439
2021-1099421,2021-08-11,000001,Vente,158000,,,LA PLACE,B115,64780,64273,Irissarry,64,,,64273000AB0161,,,,,,,,,,,,,0,,,,,P,prés,,,335,-1.232962,43.25652
2021-1099421,2021-08-11,000001,Vente,158000,,,LA PLACE,B115,64780,64273,Irissarry,64,,,64273000AB0162,,,,,,,,,,,,,0,,,,,J,jardins,,,596,-1.233134,43.256054
2021-1100315,2021-09-08,000001,Echange,600,,,HARGUINDEGUY,B079,64780,64273,Irissarry,64,,,642730000E0856,,,,,,,,,,,,,0,,,,,P,prés,,,6,-1.211721,43.230903
2021-1100315,2021-09-08,000001,Echange,600,,,HARGUINDEGUY,B079,64780,64273,Irissarry,64,,,642730000E0860,,,,,,,,,,,,,0,,,,,P,prés,,,611,-1.211544,43.231055
2021-1100316,2021-09-08,000002,Echange,1600,,,HARGUINDEGUY,B079,64780,64273,Irissarry,64,,,642730000E0357,,,,,,,,,,,,,0,,,,,P,prés,,,1600,-1.211167,43.232158
2021-1101085,2021-10-13,000001,Vente,37695,,,ERDOICE,B065,64780,64273,Irissarry,64,,,642730000G0308,,,,,,,,,,,,,0,,,,,AB,terrains a bâtir,,,936,-1.225323,43.25376
2021-1101085,2021-10-13,000001,Vente,37695,,,ERDOICE,B065,64780,64273,Irissarry,64,,,642730000G0563,,,,,,,,,,,,,0,,,,,AB,terrains a bâtir,,,141,-1.225526,43.253601
2021-1101985,2021-11-23,000001,Vente,170000,,,AIRAMENDIA,B005,64780,64273,Irissarry,64,,,642730000D0324,,,,,,,,,,,,,0,,,,,P,prés,,,551,-1.218298,43.253845
2021-1101985,2021-11-23,000001,Vente,170000,5249,,AIRAMENDIA,B005,64780,64273,Irissarry,64,,,642730000D0326,,,,,,,,,,,,,0,1,Maison,66,2,P,prés,,,2706,-1.218754,43.253765
2021-1101985,2021-11-23,000001,Vente,170000,5249,,AIRAMENDIA,B005,64780,64273,Irissarry,64,,,642730000D0326,,,,,,,,,,,,,0,1,Maison,66,2,S,sols,,,270,-1.218754,43.253765
2021-1101985,2021-11-23,000001,Vente,170000,,,AIRAMENDIA,B005,64780,64273,Irissarry,64,,,642730000D0328,,,,,,,,,,,,,0,,,,,P,prés,,,541,-1.218834,43.253155
2021-1102221,2021-12-09,000001,Vente,1,,,BEARDY,B026,64780,64273,Irissarry,64,,,642730000E0127,,,,,,,,,,,,,0,,,,,P,prés,,,396,-1.221435,43.246084
2021-1102898,2021-12-17,000001,Vente,32330,,,CHERRA CHARRE GAINEKOA,B055,64780,64273,Irissarry,64,,,642730000G0528,,,,,,,,,,,,,0,,,,,P,prés,,,1705,-1.228166,43.265624
2021-1102898,2021-12-17,000001,Vente,32330,,,CHERRA CHARRE GAINEKOA,B055,64780,64273,Irissarry,64,,,642730000G0529,,,,,,,,,,,,,0,,,,,P,prés,,,3191,-1.22873,43.265777
2021-1102898,2021-12-17,000001,Vente,32330,,,CHERRA CHARRE GAINEKOA,B055,64780,64273,Irissarry,64,,,642730000G0530,,,,,,,,,,,,,0,,,,,P,prés,,,4460,-1.228115,43.264747
2021-1102898,2021-12-17,000001,Vente,32330,,,CHERRA CHARRE GAINEKOA,B055,64780,64273,Irissarry,64,,,642730000G0531,,,,,,,,,,,,,0,,,,,P,prés,,,3763,-1.228702,43.264839
2021-1102898,2021-12-17,000001,Vente,32330,,,CHERRA CHARRE GAINEKOA,B055,64780,64273,Irissarry,64,,,642730000G0533,,,,,,,,,,,,,0,,,,,P,prés,,,3046,-1.228794,43.264069
2021-1103031,2021-12-28,000001,Vente,122993,,,CEDARRIKOALDIA,B038,64780,64273,Irissarry,64,,,642730000B0669,,,,,,,,,,,,,0,,,,,L,landes,TOUYA,Touyas,13,-1.253956,43.265881
2021-1103031,2021-12-28,000001,Vente,122993,5275,,CEDARRIKOALDIA,B038,64780,64273,Irissarry,64,,,642730000B0670,,,,,,,,,,,,,0,4,Local industriel. commercial ou assimilé,263,0,S,sols,,,2000,-1.254124,43.265611
2021-1103038,2021-12-28,000001,Vente,320000,,,CELHAY,B040,64780,64273,Irissarry,64,,,64273000AC0064,,,,,,,,,,,,,0,,,,,J,jardins,,,520,-1.225113,43.258889
2021-1103038,2021-12-28,000001,Vente,320000,5075,,CELHAY,B040,64780,64273,Irissarry,64,,,64273000AC0065,,,,,,,,,,,,,0,1,Maison,245,8,S,sols,,,460,-1.22526,43.259022
2021-1103038,2021-12-28,000001,Vente,320000,,,CELHAY,B040,64780,64273,Irissarry,64,,,64273000AC0066,,,,,,,,,,,,,0,,,,,P,prés,,,1068,-1.225363,43.25897
2021-1103038,2021-12-28,000001,Vente,320000,,,CELHAY,B040,64780,64273,Irissarry,64,,,64273000AC0132,,,,,,,,,,,,,0,,,,,S,sols,,,75,-1.225234,43.259156
