id_mutation,date_mutation,numero_disposition,nature_mutation,valeur_fonciere,adresse_numero,adresse_suffixe,adresse_nom_voie,adresse_code_voie,code_postal,code_commune,nom_commune,code_departement,ancien_code_commune,ancien_nom_commune,id_parcelle,ancien_id_parcelle,numero_volume,lot1_numero,lot1_surface_carrez,lot2_numero,lot2_surface_carrez,lot3_numero,lot3_surface_carrez,lot4_numero,lot4_surface_carrez,lot5_numero,lot5_surface_carrez,nombre_lots,code_type_local,type_local,surface_reelle_bati,nombre_pieces_principales,code_nature_culture,nature_culture,code_nature_culture_speciale,nature_culture_speciale,surface_terrain,longitude,latitude
2021-1083895,2021-02-25,000001,Vente,3000,,,MOUSTE,B101,64450,64332,Lème,64,,,643320000C0168,,,,,,,,,,,,,0,,,,,BT,taillis simples,,,4440,-0.367511,43.483992
2021-1083895,2021-02-25,000001,Vente,3000,,,MOUSTE,B101,64450,64332,Lème,64,,,643320000C0169,,,,,,,,,,,,,0,,,,,BT,taillis simples,,,5630,-0.367078,43.484547
2021-1083895,2021-02-25,000001,Vente,3000,,,CAPSUS,B027,64450,64332,Lème,64,,,643320000C0338,,,,,,,,,,,,,0,,,,,BT,taillis simples,,,2445,-0.36604,43.484533
2021-1083895,2021-02-25,000001,Vente,3000,,,CAPSUS,B027,64450,64332,Lème,64,,,643320000C0339,,,,,,,,,,,,,0,,,,,BT,taillis simples,,,4665,-0.366592,43.484027
2021-1083895,2021-02-25,000001,Vente,3000,,,CAPSUS,B027,64450,64332,Lème,64,,,643320000C0340,,,,,,,,,,,,,0,,,,,BT,taillis simples,,,2400,-0.366999,43.483696
2021-1084749,2021-04-19,000001,Vente,,,,PROYAA,B116,64450,64332,Lème,64,,,643320000C0381,,,,,,,,,,,,,0,,,,,P,prés,,,287,-0.370103,43.494679
2021-1084749,2021-04-19,000001,Vente,,,,PROYAA,B116,64450,64332,Lème,64,,,643320000C0384,,,,,,,,,,,,,0,,,,,J,jardins,,,47,-0.370223,43.494531
2021-1088672,2021-08-19,000001,Vente,100000,,,PROUSET,B114,64450,64332,Lème,64,,,643320000A0235,,,,,,,,,,,,,0,,,,,T,terres,,,10450,-0.366711,43.497939
2021-1088672,2021-08-19,000001,Vente,100000,,,PROUSET,B114,64450,64332,Lème,64,,,643320000A0236,,,,,,,,,,,,,0,,,,,P,prés,,,4000,-0.367091,43.497309
2021-1088672,2021-08-19,000001,Vente,100000,,,PROUSET,B114,64450,64332,Lème,64,,,643320000A0242,,,,,,,,,,,,,0,,,,,S,sols,,,531,-0.368334,43.498237
2021-1088672,2021-08-19,000001,Vente,100000,,,PROUSET,B114,64450,64332,Lème,64,,,643320000A0243,,,,,,,,,,,,,0,,,,,P,prés,,,8750,-0.36764,43.498304
2021-1088672,2021-08-19,000001,Vente,100000,,,PROUSET,B114,64450,64332,Lème,64,,,643320000A0244,,,,,,,,,,,,,0,,,,,P,prés,,,11000,-0.365891,43.49874
2021-1088672,2021-08-19,000001,Vente,100000,,,PROUSET,B114,64450,64332,Lème,64,,,643320000A0274,,,,,,,,,,,,,0,,,,,P,prés,,,11280,-0.366107,43.500022
2021-1088672,2021-08-19,000001,Vente,100000,,,PROUSET,B114,64450,64332,Lème,64,,,643320000A0278,,,,,,,,,,,,,0,,,,,P,prés,,,13620,-0.367276,43.499323
2021-1088672,2021-08-19,000001,Vente,100000,,,PROUSET,B114,64450,64332,Lème,64,,,643320000A0279,,,,,,,,,,,,,0,,,,,P,prés,,,11190,-0.368602,43.498875
2021-1088672,2021-08-19,000001,Vente,100000,,,PROUSET,B114,64450,64332,Lème,64,,,643320000A0279,,,,,,,,,,,,,0,,,,,S,sols,,,760,-0.368602,43.498875
2021-1091289,2021-10-07,000001,Vente,223000,5392,,MOURCHETTE,B098,64450,64332,Lème,64,,,643320000A0392,,,,,,,,,,,,,0,1,Maison,75,4,J,jardins,,,846,-0.368215,43.50472
2021-1091289,2021-10-07,000001,Vente,223000,5392,,MOURCHETTE,B098,64450,64332,Lème,64,,,643320000A0392,,,,,,,,,,,,,0,1,Maison,75,4,S,sols,,,1000,-0.368215,43.50472
2021-1091289,2021-10-07,000001,Vente,223000,5392,,MOURCHETTE,B098,64450,64332,Lème,64,,,643320000A0392,,,,,,,,,,,,,0,3,Dépendance,,0,S,sols,,,1000,-0.368215,43.50472
2021-1091289,2021-10-07,000001,Vente,223000,5392,,MOURCHETTE,B098,64450,64332,Lème,64,,,643320000A0392,,,,,,,,,,,,,0,3,Dépendance,,0,J,jardins,,,846,-0.368215,43.50472
2021-1091289,2021-10-07,000001,Vente,223000,,,MOURCHETTE,B098,64450,64332,Lème,64,,,643320000A0395,,,,,,,,,,,,,0,,,,,J,jardins,,,154,-0.368245,43.504498
