id_mutation,date_mutation,numero_disposition,nature_mutation,valeur_fonciere,adresse_numero,adresse_suffixe,adresse_nom_voie,adresse_code_voie,code_postal,code_commune,nom_commune,code_departement,ancien_code_commune,ancien_nom_commune,id_parcelle,ancien_id_parcelle,numero_volume,lot1_numero,lot1_surface_carrez,lot2_numero,lot2_surface_carrez,lot3_numero,lot3_surface_carrez,lot4_numero,lot4_surface_carrez,lot5_numero,lot5_surface_carrez,nombre_lots,code_type_local,type_local,surface_reelle_bati,nombre_pieces_principales,code_nature_culture,nature_culture,code_nature_culture_speciale,nature_culture_speciale,surface_terrain,longitude,latitude
2021-1082596,2021-01-07,000001,Vente,35000,,,LAULHAU,B076,64450,64385,Miossens-Lanusse,64,,,64385000ZB0121,,,,,,,,,,,,,0,,,,,T,terres,,,1638,-0.314036,43.475917
2021-1083660,2021-02-22,000001,Vente,35000,,,LAULHAU,B076,64450,64385,Miossens-Lanusse,64,,,64385000ZB0122,,,,,,,,,,,,,0,,,,,T,terres,,,1637,-0.313595,43.47602
2021-1086219,2021-06-03,000002,Vente,278900,,,LARRIBERE DE SEQUE,B073,64450,64385,Miossens-Lanusse,64,,,64385000ZC0008,,,,,,,,,,,,,0,,,,,T,terres,,,25866,-0.30027,43.485466
2021-1086219,2021-06-03,000002,Vente,278900,,,LARRIBERE DE SEQUE,B073,64450,64385,Miossens-Lanusse,64,,,64385000ZC0008,,,,,,,,,,,,,0,,,,,S,sols,,,1000,-0.30027,43.485466
2021-1086219,2021-06-03,000002,Vente,278900,,,LARRIBERE DE SEQUE,B073,64450,64385,Miossens-Lanusse,64,,,64385000ZC0008,,,,,,,,,,,,,0,,,,,T,terres,,,25000,-0.30027,43.485466
2021-1086833,2021-05-18,000001,Vente,29000,,,CLERCQ,B034,64450,64385,Miossens-Lanusse,64,,,64385000ZB0115,,,,,,,,,,,,,0,,,,,T,terres,,,1800,-0.311862,43.477216
2021-1087357,2021-06-18,000001,Vente,12900.8,,,LAULHAU,B076,64450,64385,Miossens-Lanusse,64,,,64385000ZB0032,,,,,,,,,,,,,0,,,,,T,terres,,,12126,-0.311248,43.475732
2021-1087357,2021-06-18,000001,Vente,12900.8,,,LAULHAU,B076,64450,64385,Miossens-Lanusse,64,,,64385000ZB0032,,,,,,,,,,,,,0,,,,,T,terres,,,4000,-0.311248,43.475732
2021-1087427,2021-04-29,000001,Vente,246050,12,,RTE DE LALONQUETTE,0060,64450,64385,Miossens-Lanusse,64,,,64385000ZB0075,,,,,,,,,,,,,0,1,Maison,119,4,S,sols,,,1000,-0.315057,43.475722
2021-1087427,2021-04-29,000001,Vente,246050,12,,RTE DE LALONQUETTE,0060,64450,64385,Miossens-Lanusse,64,,,64385000ZB0075,,,,,,,,,,,,,0,1,Maison,119,4,J,jardins,,,1000,-0.315057,43.475722
2021-1088442,2021-07-22,000001,Vente,53500,,,DE LALANDE DE BORDENAVE,B068,64450,64385,Miossens-Lanusse,64,,,64385000ZA0004,,,,,,,,,,,,,0,,,,,T,terres,,,16045,-0.317404,43.476787
2021-1088442,2021-07-22,000001,Vente,53500,,,DE LALANDE DE BORDENAVE,B068,64450,64385,Miossens-Lanusse,64,,,64385000ZA0006,,,,,,,,,,,,,0,,,,,T,terres,,,3834,-0.316941,43.475869
2021-1088442,2021-07-22,000001,Vente,53500,,,DE LALANDE DE BORDENAVE,B068,64450,64385,Miossens-Lanusse,64,,,64385000ZA0063,,,,,,,,,,,,,0,,,,,T,terres,,,21786,-0.315678,43.475081
2021-1089626,2021-09-03,000002,Vente,400,,,CASTELA,B031,64450,64385,Miossens-Lanusse,64,,,64385000ZK0054,,,,,,,,,,,,,0,,,,,T,terres,,,179,-0.300529,43.463833
2021-1090197,2021-09-21,000001,Vente,35000,,,LAULHAU,B076,64450,64385,Miossens-Lanusse,64,,,64385000ZB0120,,,,,,,,,,,,,0,,,,,T,terres,,,1632,-0.314311,43.475656
2021-1090596,2021-09-30,000001,Vente,259687,,,GRABES DE BERDOT,B044,64450,64385,Miossens-Lanusse,64,,,64385000ZI0020,,,,,,,,,,,,,0,,,,,T,terres,,,85331,-0.302645,43.449901
2021-1091757,2021-11-08,000001,Vente,135000,35,,RTE DE SAINT JACQUES,0100,64450,64385,Miossens-Lanusse,64,,,64385000ZK0057,,,,,,,,,,,,,0,1,Maison,127,5,T,terres,,,5044,-0.304637,43.463239
2021-1091757,2021-11-08,000001,Vente,135000,35,,RTE DE SAINT JACQUES,0100,64450,64385,Miossens-Lanusse,64,,,64385000ZK0057,,,,,,,,,,,,,0,1,Maison,127,5,S,sols,,,1000,-0.304637,43.463239
2021-1091760,2021-11-08,000001,Vente,20000,35,,RTE DE SAINT JACQUES,0100,64450,64385,Miossens-Lanusse,64,,,64385000ZK0056,,,,,,,,,,,,,0,,,,,P,prés,,,1019,-0.305466,43.462972
2021-1091760,2021-11-08,000001,Vente,20000,35,,RTE DE SAINT JACQUES,0100,64450,64385,Miossens-Lanusse,64,,,64385000ZK0056,,,,,,,,,,,,,0,,,,,S,sols,,,1500,-0.305466,43.462972
2021-1092576,2021-12-20,000001,Vente,316350,11,,CHE DE L ARRIOU,0012,64450,64385,Miossens-Lanusse,64,,,64385000ZB0031,,,,,,,,,,,,,0,1,Maison,169,5,S,sols,,,1000,-0.311984,43.476726
2021-1092576,2021-12-20,000001,Vente,316350,11,,CHE DE L ARRIOU,0012,64450,64385,Miossens-Lanusse,64,,,64385000ZB0031,,,,,,,,,,,,,0,3,Dépendance,,0,J,jardins,,,1004,-0.311984,43.476726
2021-1092576,2021-12-20,000001,Vente,316350,11,,CHE DE L ARRIOU,0012,64450,64385,Miossens-Lanusse,64,,,64385000ZB0031,,,,,,,,,,,,,0,3,Dépendance,,0,S,sols,,,1000,-0.311984,43.476726
2021-1092576,2021-12-20,000001,Vente,316350,11,,CHE DE L ARRIOU,0012,64450,64385,Miossens-Lanusse,64,,,64385000ZB0031,,,,,,,,,,,,,0,3,Dépendance,,0,S,sols,,,1000,-0.311984,43.476726
2021-1092576,2021-12-20,000001,Vente,316350,11,,CHE DE L ARRIOU,0012,64450,64385,Miossens-Lanusse,64,,,64385000ZB0031,,,,,,,,,,,,,0,3,Dépendance,,0,S,sols,,,1000,-0.311984,43.476726
2021-1092576,2021-12-20,000001,Vente,316350,11,,CHE DE L ARRIOU,0012,64450,64385,Miossens-Lanusse,64,,,64385000ZB0031,,,,,,,,,,,,,0,3,Dépendance,,0,J,jardins,,,1004,-0.311984,43.476726
2021-1092576,2021-12-20,000001,Vente,316350,11,,CHE DE L ARRIOU,0012,64450,64385,Miossens-Lanusse,64,,,64385000ZB0031,,,,,,,,,,,,,0,3,Dépendance,,0,J,jardins,,,1004,-0.311984,43.476726
2021-1092576,2021-12-20,000001,Vente,316350,11,,CHE DE L ARRIOU,0012,64450,64385,Miossens-Lanusse,64,,,64385000ZB0031,,,,,,,,,,,,,0,1,Maison,169,5,J,jardins,,,1004,-0.311984,43.476726
