id_mutation,date_mutation,numero_disposition,nature_mutation,valeur_fonciere,adresse_numero,adresse_suffixe,adresse_nom_voie,adresse_code_voie,code_postal,code_commune,nom_commune,code_departement,ancien_code_commune,ancien_nom_commune,id_parcelle,ancien_id_parcelle,numero_volume,lot1_numero,lot1_surface_carrez,lot2_numero,lot2_surface_carrez,lot3_numero,lot3_surface_carrez,lot4_numero,lot4_surface_carrez,lot5_numero,lot5_surface_carrez,nombre_lots,code_type_local,type_local,surface_reelle_bati,nombre_pieces_principales,code_nature_culture,nature_culture,code_nature_culture_speciale,nature_culture_speciale,surface_terrain,longitude,latitude
2021-1108692,2021-09-29,000001,Vente,168600,,,CHATEAU,B008,65350,65103,Bouilh-Péreuilh,65,,,651030000C0491,,,,,,,,,,,,,0,,,,,S,sols,,,100,0.188004,43.307256
2021-1108692,2021-09-29,000001,Vente,168600,,,CHATEAU,B008,65350,65103,Bouilh-Péreuilh,65,,,651030000C0491,,,,,,,,,,,,,0,,,,,P,prés,,,698,0.188004,43.307256
2021-1108692,2021-09-29,000001,Vente,168600,,,CHATEAU,B008,65350,65103,Bouilh-Péreuilh,65,,,651030000C0492,,,,,,,,,,,,,0,,,,,P,prés,,,300,0.18803,43.307047
2021-1108692,2021-09-29,000001,Vente,168600,1,,IMP DU CHATEAU D EAU,0025,65350,65103,Bouilh-Péreuilh,65,,,651030000C0493,,,,,,,,,,,,,0,1,Maison,87,4,S,sols,,,1052,0.188329,43.307436
2021-1108692,2021-09-29,000001,Vente,168600,1,,IMP DU CHATEAU D EAU,0025,65350,65103,Bouilh-Péreuilh,65,,,651030000C0493,,,,,,,,,,,,,0,3,Dépendance,,0,S,sols,,,1052,0.188329,43.307436
2021-1110773,2021-12-21,000003,Echange,22500,,,LANDE,B020,65350,65103,Bouilh-Péreuilh,65,,,651030000C0281,,,,,,,,,,,,,0,,,,,P,prés,,,6242,0.205888,43.310602
2021-1110773,2021-12-21,000003,Echange,22500,,,LANDE,B020,65350,65103,Bouilh-Péreuilh,65,,,651030000C0300,,,,,,,,,,,,,0,,,,,T,terres,,,5530,0.208565,43.310874
2021-1110773,2021-12-21,000003,Echange,22500,,,COUSSAN,B012,65350,65103,Bouilh-Péreuilh,65,,,651030000C0345,,,,,,,,,,,,,0,,,,,T,terres,,,10442,0.197991,43.30487
2021-1110773,2021-12-21,000003,Echange,22500,,,AUBAROUS,B001,65350,65103,Bouilh-Péreuilh,65,,,651030000D0059,,,,,,,,,,,,,0,,,,,T,terres,,,2811,0.205267,43.310666
2021-1110774,2021-12-21,000004,Echange,5500,,,LANDE,B020,65350,65103,Bouilh-Péreuilh,65,,,651030000C0307,,,,,,,,,,,,,0,,,,,T,terres,,,9264,0.208117,43.308073
2021-1110775,2021-12-21,000005,Echange,10500,,,BIASSE,B004,65350,65103,Bouilh-Péreuilh,65,,,651030000C0237,,,,,,,,,,,,,0,,,,,T,terres,,,6176,0.197138,43.308445
2021-1110775,2021-12-21,000005,Echange,10500,,,BIASSE,B004,65350,65103,Bouilh-Péreuilh,65,,,651030000C0247,,,,,,,,,,,,,0,,,,,T,terres,,,3526,0.201922,43.309622
2021-1110775,2021-12-21,000005,Echange,10500,,,BIASSE,B004,65350,65103,Bouilh-Péreuilh,65,,,651030000C0248,,,,,,,,,,,,,0,,,,,T,terres,,,2308,0.201173,43.30987
2021-1110775,2021-12-21,000005,Echange,10500,,,BIASSE,B004,65350,65103,Bouilh-Péreuilh,65,,,651030000C0249,,,,,,,,,,,,,0,,,,,T,terres,,,872,0.201113,43.309636
2021-1110775,2021-12-21,000005,Echange,10500,,,BIASSE,B004,65350,65103,Bouilh-Péreuilh,65,,,651030000C0250,,,,,,,,,,,,,0,,,,,T,terres,,,2937,0.201105,43.309306
2021-1110775,2021-12-21,000005,Echange,10500,,,LA LANDE,B021,65350,65103,Bouilh-Péreuilh,65,,,651030000E0153,,,,,,,,,,,,,0,,,,,T,terres,,,1547,0.203511,43.31271
2021-1110776,2021-12-21,000006,Echange,12700,,,LANDE,B020,65350,65103,Bouilh-Péreuilh,65,,,651030000C0305,,,,,,,,,,,,,0,,,,,T,terres,,,1341,0.209378,43.309258
2021-1110776,2021-12-21,000006,Echange,12700,,,ESPIADE,B014,65350,65103,Bouilh-Péreuilh,65,,,651030000E0122,,,,,,,,,,,,,0,,,,,T,terres,,,2280,0.201548,43.31319
2021-1110777,2021-12-21,000007,Echange,25500,,,LANDE,B020,65350,65103,Bouilh-Péreuilh,65,,,651030000A0209,,,,,,,,,,,,,0,,,,,L,landes,PATUR,Pâture plantée,5879,0.19859,43.321252
2021-1110777,2021-12-21,000007,Echange,25500,,,LANDE,B020,65350,65103,Bouilh-Péreuilh,65,,,651030000A0210,,,,,,,,,,,,,0,,,,,L,landes,,,6273,0.197589,43.320727
2021-1110777,2021-12-21,000007,Echange,25500,,,LANDE,B020,65350,65103,Bouilh-Péreuilh,65,,,651030000A0211,,,,,,,,,,,,,0,,,,,L,landes,PATUR,Pâture plantée,5049,0.196983,43.320383
2021-1110777,2021-12-21,000007,Echange,25500,,,LANDE,B020,65350,65103,Bouilh-Péreuilh,65,,,651030000A0231,,,,,,,,,,,,,0,,,,,T,terres,,,7108,0.203692,43.319994
2021-1110777,2021-12-21,000007,Echange,25500,,,LANDE,B020,65350,65103,Bouilh-Péreuilh,65,,,651030000A0287,,,,,,,,,,,,,0,,,,,T,terres,,,6735,0.205042,43.320449
2021-1110779,2021-12-21,000009,Echange,31000,,,LANDE,B020,65350,65103,Bouilh-Péreuilh,65,,,651030000C0293,,,,,,,,,,,,,0,,,,,T,terres,,,10347,0.210425,43.313439
2021-1110779,2021-12-21,000009,Echange,31000,,,LA LANDE,B021,65350,65103,Bouilh-Péreuilh,65,,,651030000E0144,,,,,,,,,,,,,0,,,,,T,terres,,,11099,0.205862,43.315432
2021-1110779,2021-12-21,000009,Echange,31000,,,LA LANDE,B021,65350,65103,Bouilh-Péreuilh,65,,,651030000E0148,,,,,,,,,,,,,0,,,,,T,terres,,,2954,0.203036,43.313823
2021-1110779,2021-12-21,000009,Echange,31000,,,LA LANDE,B021,65350,65103,Bouilh-Péreuilh,65,,,651030000E0149,,,,,,,,,,,,,0,,,,,T,terres,,,2908,0.202442,43.313365
2021-1110779,2021-12-21,000009,Echange,31000,,,LA LANDE,B021,65350,65103,Bouilh-Péreuilh,65,,,651030000E0154,,,,,,,,,,,,,0,,,,,T,terres,,,8032,0.203041,43.312764
2021-1110781,2021-12-21,000011,Echange,20500,,,LANDE,B020,65350,65103,Bouilh-Péreuilh,65,,,651030000A0311,,,,,,,,,,,,,0,,,,,T,terres,,,6447,0.205139,43.317766
2021-1110781,2021-12-21,000011,Echange,20500,,,ESPIADE,B014,65350,65103,Bouilh-Péreuilh,65,,,651030000E0131,,,,,,,,,,,,,0,,,,,P,prés,,,11395,0.200051,43.315657
2021-1110782,2021-12-21,000012,Echange,4500,,,BIASSE,B004,65350,65103,Bouilh-Péreuilh,65,,,651030000C0218,,,,,,,,,,,,,0,,,,,BT,taillis simples,,,979,0.190694,43.309016
2021-1110782,2021-12-21,000012,Echange,4500,,,BIASSE,B004,65350,65103,Bouilh-Péreuilh,65,,,651030000C0219,,,,,,,,,,,,,0,,,,,BT,taillis simples,,,3041,0.190331,43.308464
2021-1110782,2021-12-21,000012,Echange,4500,,,LANDE,B020,65350,65103,Bouilh-Péreuilh,65,,,651030000C0265,,,,,,,,,,,,,0,,,,,L,landes,PATUR,Pâture plantée,3518,0.202487,43.309021
2021-1110842,2021-09-21,000001,Vente,180000,22,,RTE DE PEREUILH,0055,65350,65103,Bouilh-Péreuilh,65,,,651030000D0041,,,,,,,,,,,,,0,1,Maison,275,7,P,prés,,,4149,0.197666,43.311635
2021-1110842,2021-09-21,000001,Vente,180000,22,,RTE DE PEREUILH,0055,65350,65103,Bouilh-Péreuilh,65,,,651030000D0041,,,,,,,,,,,,,0,3,Dépendance,,0,S,sols,,,1500,0.197666,43.311635
2021-1110842,2021-09-21,000001,Vente,180000,22,,RTE DE PEREUILH,0055,65350,65103,Bouilh-Péreuilh,65,,,651030000D0041,,,,,,,,,,,,,0,3,Dépendance,,0,S,sols,,,1500,0.197666,43.311635
2021-1110842,2021-09-21,000001,Vente,180000,22,,RTE DE PEREUILH,0055,65350,65103,Bouilh-Péreuilh,65,,,651030000D0041,,,,,,,,,,,,,0,1,Maison,275,7,S,sols,,,1500,0.197666,43.311635
2021-1110842,2021-09-21,000001,Vente,180000,22,,RTE DE PEREUILH,0055,65350,65103,Bouilh-Péreuilh,65,,,651030000D0041,,,,,,,,,,,,,0,3,Dépendance,,0,P,prés,,,4149,0.197666,43.311635
2021-1110842,2021-09-21,000001,Vente,180000,22,,RTE DE PEREUILH,0055,65350,65103,Bouilh-Péreuilh,65,,,651030000D0041,,,,,,,,,,,,,0,3,Dépendance,,0,P,prés,,,4149,0.197666,43.311635
2021-1110842,2021-09-21,000001,Vente,180000,,,PLANTERES,B031,65350,65103,Bouilh-Péreuilh,65,,,651030000D0042,,,,,,,,,,,,,0,,,,,P,prés,,,1053,0.197495,43.312165
2021-1110842,2021-09-21,000001,Vente,180000,,,PLANTERES,B031,65350,65103,Bouilh-Péreuilh,65,,,651030000D0042,,,,,,,,,,,,,0,,,,,S,sols,,,1000,0.197495,43.312165
2021-1110842,2021-09-21,000001,Vente,180000,,,PLANTERES,B031,65350,65103,Bouilh-Péreuilh,65,,,651030000D0043,,,,,,,,,,,,,0,,,,,P,prés,,,1291,0.198114,43.311847
2021-1110842,2021-09-21,000001,Vente,180000,,,PLANTERES,B031,65350,65103,Bouilh-Péreuilh,65,,,651030000D0085,,,,,,,,,,,,,0,,,,,P,prés,,,683,0.19854,43.311852
2021-1110842,2021-09-21,000001,Vente,180000,,,PLANTERES,B031,65350,65103,Bouilh-Péreuilh,65,,,651030000D0087,,,,,,,,,,,,,0,,,,,P,prés,,,2372,0.198452,43.311742
