id_mutation,date_mutation,numero_disposition,nature_mutation,valeur_fonciere,adresse_numero,adresse_suffixe,adresse_nom_voie,adresse_code_voie,code_postal,code_commune,nom_commune,code_departement,ancien_code_commune,ancien_nom_commune,id_parcelle,ancien_id_parcelle,numero_volume,lot1_numero,lot1_surface_carrez,lot2_numero,lot2_surface_carrez,lot3_numero,lot3_surface_carrez,lot4_numero,lot4_surface_carrez,lot5_numero,lot5_surface_carrez,nombre_lots,code_type_local,type_local,surface_reelle_bati,nombre_pieces_principales,code_nature_culture,nature_culture,code_nature_culture_speciale,nature_culture_speciale,surface_terrain,longitude,latitude
2021-1103366,2021-01-19,000001,Vente,,,,GELABAT,B005,65140,65418,Sénac,65,,,654180000D0616,,,,,,,,,,,,,0,,,,,P,prés,,,1871,0.178685,43.355612
2021-1103367,2021-01-19,000002,Vente,109000,,,GELABAT,B005,65140,65418,Sénac,65,,,654180000D0592,,,,,,,,,,,,,0,,,,,P,prés,,,1370,0.179576,43.355723
2021-1103367,2021-01-19,000002,Vente,109000,,,GELABAT,B005,65140,65418,Sénac,65,,,654180000D0592,,,,,,,,,,,,,0,,,,,S,sols,,,500,0.179576,43.355723
2021-1103367,2021-01-19,000002,Vente,109000,,,GELABAT,B005,65140,65418,Sénac,65,,,654180000D0593,,,,,,,,,,,,,0,,,,,T,terres,,,238,0.1795,43.355883
2021-1103367,2021-01-19,000002,Vente,109000,16,,RUE DE RICALIS,0065,65140,65418,Sénac,65,,,654180000D0615,,,,,,,,,,,,,0,1,Maison,134,6,S,sols,,,1085,0.179287,43.355735
2021-1103367,2021-01-19,000002,Vente,109000,16,,RUE DE RICALIS,0065,65140,65418,Sénac,65,,,654180000D0615,,,,,,,,,,,,,0,1,Maison,134,6,J,jardins,,,700,0.179287,43.355735
2021-1104177,2021-02-22,000001,Vente,150000,9,,RTE DE MANSAN,0045,65140,65418,Sénac,65,,,65418000ZC0013,,,,,,,,,,,,,0,3,Dépendance,,0,L,landes,,,34698,0.195492,43.351708
2021-1104177,2021-02-22,000001,Vente,150000,9,,RTE DE MANSAN,0045,65140,65418,Sénac,65,,,65418000ZC0013,,,,,,,,,,,,,0,1,Maison,130,4,L,landes,,,34698,0.195492,43.351708
2021-1104177,2021-02-22,000001,Vente,150000,9,,RTE DE MANSAN,0045,65140,65418,Sénac,65,,,65418000ZC0013,,,,,,,,,,,,,0,3,Dépendance,,0,S,sols,,,1500,0.195492,43.351708
2021-1104177,2021-02-22,000001,Vente,150000,9,,RTE DE MANSAN,0045,65140,65418,Sénac,65,,,65418000ZC0013,,,,,,,,,,,,,0,1,Maison,130,4,S,sols,,,1500,0.195492,43.351708
2021-1104261,2021-03-18,000001,Vente,53572,2,,RTE DE MANSAN,0045,65140,65418,Sénac,65,,,654180000C0076,,,,,,,,,,,,,0,1,Maison,115,4,S,sols,,,1398,0.19317,43.35405
2021-1104261,2021-03-18,000001,Vente,53572,,,TAILLEURGAT,B023,65140,65418,Sénac,65,,,654180000C0077,,,,,,,,,,,,,0,,,,,S,sols,,,200,0.193392,43.353666
2021-1104261,2021-03-18,000001,Vente,53572,,,TAILLEURGAT,B023,65140,65418,Sénac,65,,,654180000C0077,,,,,,,,,,,,,0,,,,,P,prés,,,2581,0.193392,43.353666
2021-1104312,2021-03-23,000001,Vente,231800,,,LAHITOU,B008,65140,65418,Sénac,65,,,654180000E0350,,,,,,,,,,,,,0,,,,,P,prés,,,280,0.191512,43.368304
2021-1104312,2021-03-23,000001,Vente,231800,,,LAHITOU,B008,65140,65418,Sénac,65,,,654180000E0352,,,,,,,,,,,,,0,,,,,T,terres,,,159,0.191352,43.36828
2021-1104312,2021-03-23,000001,Vente,231800,,,LAHITOU,B008,65140,65418,Sénac,65,,,654180000E0354,,,,,,,,,,,,,0,,,,,T,terres,,,425,0.191052,43.368327
2021-1104312,2021-03-23,000001,Vente,231800,,,LAHITOU,B008,65140,65418,Sénac,65,,,654180000E0356,,,,,,,,,,,,,0,,,,,P,prés,,,411,0.191197,43.368425
2021-1104312,2021-03-23,000001,Vente,231800,8,,IMP DE LAHITAU,0030,65140,65418,Sénac,65,,,654180000E0357,,,,,,,,,,,,,0,1,Maison,162,5,S,sols,,,1168,0.191308,43.368514
2021-1104380,2021-03-04,000001,Vente,1000,,,LAHITOU,B008,65140,65418,Sénac,65,,,654180000E0234,,,,,,,,,,,,,0,,,,,BS,taillis sous futaie,,,2358,0.190669,43.370611
2021-1104692,2021-04-08,000001,Vente,135000,,,LAHITOU,B008,65140,65418,Sénac,65,,,654180000E0359,,,,,,,,,,,,,0,,,,,AB,terrains a bâtir,,,1000,0.190571,43.368921
2021-1104692,2021-04-08,000001,Vente,135000,,,LAHITOU,B008,65140,65418,Sénac,65,,,654180000E0359,,,,,,,,,,,,,0,,,,,P,prés,,,731,0.190571,43.368921
2021-1104692,2021-04-08,000001,Vente,135000,,,LAHITOU,B008,65140,65418,Sénac,65,,,654180000E0360,,,,,,,,,,,,,0,,,,,T,terres,,,1460,0.190192,43.369066
2021-1104692,2021-04-08,000001,Vente,135000,,,LAHITOU,B008,65140,65418,Sénac,65,,,654180000E0363,,,,,,,,,,,,,0,,,,,T,terres,,,64,0.19094,43.36884
2021-1105013,2021-04-20,000001,Vente,2000,,,LES BARDESQUES,B001,65140,65418,Sénac,65,,,654180000A0180,,,,,,,,,,,,,0,,,,,L,landes,,,4340,0.178712,43.366104
2021-1105039,2021-04-20,000001,Vente,34000,,,LALANNE,B009,65140,65418,Sénac,65,,,65418000ZC0060,,,,,,,,,,,,,0,,,,,T,terres,,,34126,0.195559,43.346162
2021-1105039,2021-04-20,000001,Vente,34000,,,LALANNE,B009,65140,65418,Sénac,65,,,65418000ZC0061,,,,,,,,,,,,,0,,,,,T,terres,,,1993,0.193635,43.345922
2021-1105364,2021-05-07,000001,Vente,4020,,,LONQUETS,B014,65140,65418,Sénac,65,,,654180000C0253,,,,,,,,,,,,,0,,,,,T,terres,,,7517,0.186004,43.346319
2021-1105364,2021-05-07,000001,Vente,4020,,,LONQUETS,B014,65140,65418,Sénac,65,,,654180000C0325,,,,,,,,,,,,,0,,,,,L,landes,,,4440,0.188842,43.34654
2021-1106191,2021-06-01,000001,Vente,186000,6,,IMP LE PEREUIL,0055,65140,65418,Sénac,65,,,654180000D0575,,,,,,,,,,,,,0,1,Maison,135,6,P,prés,,,3069,0.176376,43.355815
2021-1106191,2021-06-01,000001,Vente,186000,6,,IMP LE PEREUIL,0055,65140,65418,Sénac,65,,,654180000D0575,,,,,,,,,,,,,0,3,Dépendance,,0,P,prés,,,3069,0.176376,43.355815
2021-1106191,2021-06-01,000001,Vente,186000,6,,IMP LE PEREUIL,0055,65140,65418,Sénac,65,,,654180000D0575,,,,,,,,,,,,,0,1,Maison,135,6,S,sols,,,1000,0.176376,43.355815
2021-1106191,2021-06-01,000001,Vente,186000,6,,IMP LE PEREUIL,0055,65140,65418,Sénac,65,,,654180000D0575,,,,,,,,,,,,,0,3,Dépendance,,0,S,sols,,,1000,0.176376,43.355815
2021-1106191,2021-06-01,000001,Vente,186000,6,,IMP LE PEREUIL,0055,65140,65418,Sénac,65,,,654180000D0575,,,,,,,,,,,,,0,3,Dépendance,,0,S,sols,,,1000,0.176376,43.355815
2021-1106191,2021-06-01,000001,Vente,186000,6,,IMP LE PEREUIL,0055,65140,65418,Sénac,65,,,654180000D0575,,,,,,,,,,,,,0,3,Dépendance,,0,P,prés,,,3069,0.176376,43.355815
2021-1106235,2021-06-15,000001,Vente,82790,,,BOUSQUO,B002,65140,65418,Sénac,65,,,654180000B0121,,,,,,,,,,,,,0,,,,,T,terres,,,7059,0.205806,43.360957
2021-1106235,2021-06-15,000001,Vente,82790,,,BOUSQUO,B002,65140,65418,Sénac,65,,,654180000B0122,,,,,,,,,,,,,0,,,,,T,terres,,,5415,0.20619,43.360931
2021-1106235,2021-06-15,000001,Vente,82790,,,BOUSQUO,B002,65140,65418,Sénac,65,,,654180000B0123,,,,,,,,,,,,,0,,,,,T,terres,,,7130,0.206117,43.360371
2021-1106235,2021-06-15,000001,Vente,82790,,,BOUSQUO,B002,65140,65418,Sénac,65,,,654180000B0127,,,,,,,,,,,,,0,,,,,T,terres,,,11662,0.206975,43.359615
2021-1106235,2021-06-15,000001,Vente,82790,,,BOUSQUO,B002,65140,65418,Sénac,65,,,654180000B0128,,,,,,,,,,,,,0,,,,,T,terres,,,3173,0.207048,43.358513
2021-1106235,2021-06-15,000001,Vente,82790,,,LARICAUDE,B010,65140,65418,Sénac,65,,,65418000ZC0012,,,,,,,,,,,,,0,,,,,T,terres,,,14830,0.191927,43.351044
2021-1106235,2021-06-15,000001,Vente,82790,,,LARICAUDE,B010,65140,65418,Sénac,65,,,65418000ZC0012,,,,,,,,,,,,,0,,,,,T,terres,,,29656,0.191927,43.351044
2021-1106235,2021-06-15,000001,Vente,82790,,,LARICAUDE,B010,65140,65418,Sénac,65,,,65418000ZC0072,,,,,,,,,,,,,0,,,,,T,terres,,,14725,0.192228,43.352979
2021-1106235,2021-06-15,000001,Vente,82790,,,LARICAUDE,B010,65140,65418,Sénac,65,,,65418000ZC0072,,,,,,,,,,,,,0,,,,,T,terres,,,14725,0.192228,43.352979
2021-1106346,2021-06-28,000001,Vente,5298,,,LONQUETS,B014,65140,65418,Sénac,65,,,654180000C0272,,,,,,,,,,,,,0,,,,,L,landes,,,2455,0.18207,43.346999
2021-1106346,2021-06-28,000001,Vente,5298,,,LONQUETS,B014,65140,65418,Sénac,65,,,654180000C0273,,,,,,,,,,,,,0,,,,,L,landes,,,4968,0.182433,43.346209
2021-1106346,2021-06-28,000001,Vente,5298,,,LONQUETS,B014,65140,65418,Sénac,65,,,654180000C0274,,,,,,,,,,,,,0,,,,,T,terres,,,3604,0.181968,43.346427
2021-1106346,2021-06-28,000001,Vente,5298,,,LONQUETS,B014,65140,65418,Sénac,65,,,654180000C0275,,,,,,,,,,,,,0,,,,,L,landes,,,9130,0.1812,43.346486
2021-1106346,2021-06-28,000001,Vente,5298,,,LONQUETS,B014,65140,65418,Sénac,65,,,654180000C0277,,,,,,,,,,,,,0,,,,,L,landes,,,2076,0.181965,43.346057
2021-1106346,2021-06-28,000001,Vente,5298,,,LONQUETS,B014,65140,65418,Sénac,65,,,654180000C0278,,,,,,,,,,,,,0,,,,,L,landes,,,4257,0.182008,43.345675
2021-1106432,2021-06-29,000001,Vente,15000,10,,RUE DE L ESCUDE,0015,65140,65418,Sénac,65,,,654180000A0824,,,,,,,,,,,,,0,,,,,T,terres,,,2341,0.191085,43.362651
2021-1106856,2021-07-06,000001,Vente,25000,,,PEREUIL,B018,65140,65418,Sénac,65,,,654180000D0586,,,,,,,,,,,,,0,,,,,P,prés,,,142,0.177476,43.355997
2021-1106856,2021-07-06,000001,Vente,25000,,,PEREUIL,B018,65140,65418,Sénac,65,,,654180000D0589,,,,,,,,,,,,,0,,,,,T,terres,,,2438,0.177155,43.356348
2021-1107031,2021-07-07,000001,Vente,178403,17,,RTE DE RABASTENS DE BIGORRE,0060,65140,65418,Sénac,65,,,654180000D0424,,,,,,,,,,,,,0,1,Maison,134,5,T,terres,,,2590,0.179276,43.35709
2021-1107031,2021-07-07,000001,Vente,178403,17,,RTE DE RABASTENS DE BIGORRE,0060,65140,65418,Sénac,65,,,654180000D0424,,,,,,,,,,,,,0,1,Maison,134,5,S,sols,,,1000,0.179276,43.35709
2021-1107919,2021-08-12,000003,Vente,28000,,,GELABAT,B005,65140,65418,Sénac,65,,,654180000D0620,,,,,,,,,,,,,0,,,,,S,sols,,,64,0.182559,43.356276
2021-1107919,2021-08-12,000003,Vente,28000,,,GELABAT,B005,65140,65418,Sénac,65,,,654180000D0621,,,,,,,,,,,,,0,,,,,P,prés,,,1005,0.18268,43.35633
2021-1108415,2021-09-14,000001,Vente,250,,,LARICAUDE,B010,65140,65418,Sénac,65,,,654180000C0159,,,,,,,,,,,,,0,,,,,L,landes,,,1216,0.188303,43.350224
2021-1108415,2021-09-14,000001,Vente,250,,,LARICAUDE,B010,65140,65418,Sénac,65,,,654180000C0161,,,,,,,,,,,,,0,,,,,L,landes,,,693,0.188382,43.350007
2021-1108415,2021-09-14,000001,Vente,250,,,LARICAUDE,B010,65140,65418,Sénac,65,,,654180000C0164,,,,,,,,,,,,,0,,,,,L,landes,,,2152,0.187625,43.350042
2021-1108419,2021-09-14,000001,Vente,14000,,,RICALOT,B021,65140,65418,Sénac,65,,,654180000A0412,,,,,,,,,,,,,0,,,,,P,prés,,,5820,0.189467,43.361591
2021-1108419,2021-09-14,000001,Vente,14000,,,RICALOT,B021,65140,65418,Sénac,65,,,654180000A0413,,,,,,,,,,,,,0,,,,,BF,futaies feuillues,,,997,0.189294,43.361364
2021-1108419,2021-09-14,000001,Vente,14000,,,RICALOT,B021,65140,65418,Sénac,65,,,654180000A0415,,,,,,,,,,,,,0,,,,,BT,taillis simples,,,1060,0.188307,43.361356
2021-1108419,2021-09-14,000001,Vente,14000,,,RICALOT,B021,65140,65418,Sénac,65,,,654180000A0417,,,,,,,,,,,,,0,,,,,BS,taillis sous futaie,,,1425,0.189024,43.360901
2021-1108419,2021-09-14,000001,Vente,14000,,,RICALOT,B021,65140,65418,Sénac,65,,,654180000A0419,,,,,,,,,,,,,0,,,,,T,terres,,,3275,0.189213,43.36061
2021-1108419,2021-09-14,000001,Vente,14000,,,RICALOT,B021,65140,65418,Sénac,65,,,654180000A0420,,,,,,,,,,,,,0,,,,,T,terres,,,3003,0.188649,43.360686
2021-1108419,2021-09-14,000001,Vente,14000,,,RICALOT,B021,65140,65418,Sénac,65,,,654180000A0422,,,,,,,,,,,,,0,,,,,P,prés,,,670,0.189208,43.360216
2021-1108419,2021-09-14,000001,Vente,14000,,,RICALOT,B021,65140,65418,Sénac,65,,,654180000A0423,,,,,,,,,,,,,0,,,,,P,prés,,,855,0.189459,43.360189
2021-1108419,2021-09-14,000001,Vente,14000,,,RICALOT,B021,65140,65418,Sénac,65,,,654180000A0424,,,,,,,,,,,,,0,,,,,S,sols,,,573,0.189649,43.360046
2021-1108419,2021-09-14,000001,Vente,14000,,,RICALOT,B021,65140,65418,Sénac,65,,,654180000A0425,,,,,,,,,,,,,0,,,,,P,prés,,,5635,0.189919,43.36047
2021-1108419,2021-09-14,000001,Vente,14000,,,RICALOT,B021,65140,65418,Sénac,65,,,654180000A0426,,,,,,,,,,,,,0,,,,,T,terres,,,1348,0.190315,43.361313
2021-1108419,2021-09-14,000001,Vente,14000,,,RICALOT,B021,65140,65418,Sénac,65,,,654180000A0427,,,,,,,,,,,,,0,,,,,P,prés,,,740,0.190497,43.36153
2021-1108419,2021-09-14,000001,Vente,14000,,,RICALOT,B021,65140,65418,Sénac,65,,,654180000A0428,,,,,,,,,,,,,0,,,,,BT,taillis simples,,,230,0.190498,43.361621
2021-1108419,2021-09-14,000001,Vente,14000,,,RICALOT,B021,65140,65418,Sénac,65,,,654180000A0429,,,,,,,,,,,,,0,,,,,BT,taillis simples,,,105,0.190578,43.361642
2021-1109122,2021-10-13,000002,Vente,4618,,,LACAUSSADE,B007,65140,65418,Sénac,65,,,654180000B0358,,,,,,,,,,,,,0,,,,,T,terres,,,88,0.185805,43.356853
2021-1109122,2021-10-13,000002,Vente,4618,,,LACAUSSADE,B007,65140,65418,Sénac,65,,,654180000B0381,,,,,,,,,,,,,0,,,,,S,sols,,,388,0.185503,43.356871
2021-1109122,2021-10-13,000002,Vente,4618,,,LACAUSSADE,B007,65140,65418,Sénac,65,,,654180000B0383,,,,,,,,,,,,,0,,,,,T,terres,,,1339,0.185676,43.357046
2021-1109122,2021-10-13,000002,Vente,4618,,,LACAUSSADE,B007,65140,65418,Sénac,65,,,654180000B0385,,,,,,,,,,,,,0,,,,,P,prés,,,2563,0.185654,43.357457
2021-1109122,2021-10-13,000002,Vente,4618,,,LACAUSSADE,B007,65140,65418,Sénac,65,,,654180000B0387,,,,,,,,,,,,,0,,,,,BT,taillis simples,,,372,0.185492,43.357714
2021-1109659,2021-11-12,000001,Vente,252000,20,,RTE DE TRIE SUR BAISE,0075,65140,65418,Sénac,65,,,65418000ZC0016,,,,,,,,,,,,,0,3,Dépendance,,0,S,sols,,,562,0.193783,43.354172
2021-1109659,2021-11-12,000001,Vente,252000,20,,RTE DE TRIE SUR BAISE,0075,65140,65418,Sénac,65,,,65418000ZC0017,,,,,,,,,,,,,0,1,Maison,85,4,T,terres,,,3449,0.194074,43.353936
2021-1109659,2021-11-12,000001,Vente,252000,20,,RTE DE TRIE SUR BAISE,0075,65140,65418,Sénac,65,,,65418000ZC0017,,,,,,,,,,,,,0,1,Maison,85,4,S,sols,,,600,0.194074,43.353936
2021-1110610,2021-12-28,000001,Vente,65000,,,LES HOUGAROUS,B006,65140,65418,Sénac,65,,,65418000ZC0030,,,,,,,,,,,,,0,,,,,T,terres,,,65230,0.20615,43.35253
2021-1110866,2021-12-08,000002,Echange,1,,,LAS COSTES,B012,65140,65418,Sénac,65,,,654180000A0026,,,,,,,,,,,,,0,,,,,BT,taillis simples,,,385,0.168074,43.359298
2021-1110866,2021-12-08,000002,Echange,1,,,LAS COSTES,B012,65140,65418,Sénac,65,,,654180000A0813,,,,,,,,,,,,,0,,,,,BS,taillis sous futaie,,,1170,0.167407,43.361297
2021-1110866,2021-12-08,000002,Echange,1,,,LAS COSTES,B012,65140,65418,Sénac,65,,,654180000A0815,,,,,,,,,,,,,0,,,,,BS,taillis sous futaie,,,1257,0.16756,43.361038
2021-1110866,2021-12-08,000002,Echange,1,,,LAS COSTES,B012,65140,65418,Sénac,65,,,654180000A0817,,,,,,,,,,,,,0,,,,,BS,taillis sous futaie,,,1594,0.16779,43.36075
2021-1110866,2021-12-08,000002,Echange,1,,,LAS COSTES,B012,65140,65418,Sénac,65,,,654180000A0819,,,,,,,,,,,,,0,,,,,BS,taillis sous futaie,,,366,0.168264,43.360564
2021-1110866,2021-12-08,000002,Echange,1,,,LAS COSTES,B012,65140,65418,Sénac,65,,,654180000A0821,,,,,,,,,,,,,0,,,,,T,terres,,,44,0.168262,43.359406
