id_mutation,date_mutation,numero_disposition,nature_mutation,valeur_fonciere,adresse_numero,adresse_suffixe,adresse_nom_voie,adresse_code_voie,code_postal,code_commune,nom_commune,code_departement,ancien_code_commune,ancien_nom_commune,id_parcelle,ancien_id_parcelle,numero_volume,lot1_numero,lot1_surface_carrez,lot2_numero,lot2_surface_carrez,lot3_numero,lot3_surface_carrez,lot4_numero,lot4_surface_carrez,lot5_numero,lot5_surface_carrez,nombre_lots,code_type_local,type_local,surface_reelle_bati,nombre_pieces_principales,code_nature_culture,nature_culture,code_nature_culture_speciale,nature_culture_speciale,surface_terrain,longitude,latitude
2021-1122968,2021-01-14,000001,Vente,225000,15,,RUE DE LA CHAPELLE,0120,66220,66097,Lesquerde,66,,,66097000AC0041,,,,,,,,,,,,,0,1,Maison,111,5,S,sols,,,1050,2.531706,42.799009
2021-1123516,2021-02-02,000001,Vente,10000,5002,F,LE VILLAGE,B099,66220,66097,Lesquerde,66,,,66097000AB0126,,,,,,,,,,,,,0,3,Dépendance,,0,S,sols,,,40,2.529617,42.800696
2021-1123516,2021-02-02,000001,Vente,10000,,,LE VILLAGE,B099,66220,66097,Lesquerde,66,,,66097000AB0131,,,,,,,,,,,,,0,,,,,S,sols,,,128,2.529635,42.800595
2021-1123802,2021-02-27,000001,Vente,50000,,,LE VILLAGE,B099,66220,66097,Lesquerde,66,,,66097000AB0103,,,,,,,,,,,,,0,,,,,S,sols,,,120,2.529487,42.800282
2021-1123802,2021-02-27,000001,Vente,50000,39,,LE VILLAGE,B099,66220,66097,Lesquerde,66,,,66097000AB0104,,,,,,,,,,,,,0,1,Maison,78,4,S,sols,,,85,2.529508,42.800215
2021-1123947,2021-02-23,000001,Vente,2500,,,LE VILLAGE,B099,66220,66097,Lesquerde,66,,,66097000AB0138,,,,,,,,,,,,,0,,,,,S,sols,,,29,2.530086,42.801015
2021-1124074,2021-03-11,000001,Vente,1500,,,LA CANALETTE,B026,66220,66097,Lesquerde,66,,,66097000AD0268,,,,,,,,,,,,,0,,,,,BT,taillis simples,,,1985,2.539091,42.801294
2021-1124074,2021-03-11,000001,Vente,1500,,,L ABEURADOU,B002,66220,66097,Lesquerde,66,,,66097000AD0459,,,,,,,,,,,,,0,,,,,L,landes,,,205,2.532592,42.80162
2021-1124221,2021-03-05,000001,Vente,500,,,LE VILLAGE,B099,66220,66097,Lesquerde,66,,,66097000AB0233,,,,,,,,,,,,,0,,,,,S,sols,,,72,2.529516,42.799641
2021-1124939,2021-04-06,000001,Vente,82000,2,,RUE DES JARDINS,0360,66220,66097,Lesquerde,66,,,66097000AB0051,,,,,,,,,,,,,0,1,Maison,65,2,S,sols,,,35,2.529956,42.800013
2021-1124939,2021-04-06,000001,Vente,82000,,,LE VILLAGE,B099,66220,66097,Lesquerde,66,,,66097000AB0052,,,,,,,,,,,,,0,,,,,S,sols,,,26,2.53,42.799978
2021-1125544,2021-05-03,000001,Vente,67500,29,,LE VILLAGE,B099,66220,66097,Lesquerde,66,,,66097000AB0147,,,,,,,,,,,,,0,1,Maison,125,6,S,sols,,,81,2.530331,42.801021
2021-1125845,2021-06-07,000001,Vente,55000,41,,RUE DU CAPITOUL,0105,66220,66097,Lesquerde,66,,,66097000AB0049,,,,,,,,,,,,,0,1,Maison,88,3,S,sols,,,51,2.529888,42.800091
2021-1126780,2021-06-22,000001,Vente,81600,,,LE VILLAGE,B099,66220,66097,Lesquerde,66,,,66097000AB0077,,,,,,,,,,,,,0,,,,,S,sols,,,118,2.529584,42.799698
2021-1126780,2021-06-22,000001,Vente,81600,49,,RUE DU CAPITOUL,0105,66220,66097,Lesquerde,66,,,66097000AB0174,,,,,,,,,,,,,0,1,Maison,71,3,S,sols,,,51,2.529717,42.799657
2021-1127047,2021-07-13,000001,Vente,99000,19,,RUE DU CAPITOUL,0105,66220,66097,Lesquerde,66,,,66097000AB0033,,,,,,,,,,,,,0,1,Maison,90,5,S,sols,,,76,2.531129,42.801436
2021-1127319,2021-08-04,000001,Vente,1000,,,SERRE DE LLAOUROU,B088,66220,66097,Lesquerde,66,,,660970000B0249,,,,,,,,,,,,,0,,,,,VI,vignes,,,2516,2.578523,42.792668
2021-1127319,2021-08-04,000001,Vente,1000,,,SERRE DE LLAOUROU,B088,66220,66097,Lesquerde,66,,,660970000B0249,,,,,,,,,,,,,0,,,,,L,landes,,,1144,2.578523,42.792668
2021-1127588,2021-07-26,000001,Vente,30000,10,,LE VILLAGE,B099,66220,66097,Lesquerde,66,,,66097000AB0021,,,,,,,,,,,,,0,1,Maison,90,6,S,sols,,,340,2.5317,42.802019
2021-1128631,2021-09-15,000001,Vente,53000,30,,RUE DU CAPITOUL,0105,66220,66097,Lesquerde,66,,,66097000AB0041,,,3,,,,,,,,,,1,2,Appartement,56,3,,,,,,2.530339,42.800805
2021-1128631,2021-09-15,000001,Vente,53000,30,,RUE DU CAPITOUL,0105,66220,66097,Lesquerde,66,,,66097000AB0041,,,1,,,,,,,,,,1,3,Dépendance,,0,,,,,,2.530339,42.800805
2021-1128631,2021-09-15,000001,Vente,53000,30,,RUE DU CAPITOUL,0105,66220,66097,Lesquerde,66,,,66097000AB0041,,,2,,,,,,,,,,1,2,Appartement,58,3,,,,,,2.530339,42.800805
2021-1129418,2021-10-26,000001,Vente,500,,,LE VILLAGE,B099,66220,66097,Lesquerde,66,,,66097000AB0076,,,,,,,,,,,,,0,,,,,S,sols,,,138,2.529552,42.799511
2021-1130066,2021-11-10,000001,Vente,1200,,,BEZAUDU,B009,66220,66097,Lesquerde,66,,,66097000AH0212,,,,,,,,,,,,,0,,,,,VI,vignes,,,5093,2.56872,42.789176
2021-1130419,2021-12-14,000001,Vente,1000,,,LE VILLAGE,B099,66220,66097,Lesquerde,66,,,66097000AB0017,,,,,,,,,,,,,0,,,,,L,landes,,,235,2.53199,42.802113
2021-1130725,2021-12-17,000001,Vente,1500,,,CAMP D EN REYNES,B021,66220,66097,Lesquerde,66,,,66097000AC0062,,,,,,,,,,,,,0,,,,,T,terres,,,7070,2.529449,42.796968
