id_mutation,date_mutation,numero_disposition,nature_mutation,valeur_fonciere,adresse_numero,adresse_suffixe,adresse_nom_voie,adresse_code_voie,code_postal,code_commune,nom_commune,code_departement,ancien_code_commune,ancien_nom_commune,id_parcelle,ancien_id_parcelle,numero_volume,lot1_numero,lot1_surface_carrez,lot2_numero,lot2_surface_carrez,lot3_numero,lot3_surface_carrez,lot4_numero,lot4_surface_carrez,lot5_numero,lot5_surface_carrez,nombre_lots,code_type_local,type_local,surface_reelle_bati,nombre_pieces_principales,code_nature_culture,nature_culture,code_nature_culture_speciale,nature_culture_speciale,surface_terrain,longitude,latitude
2021-1123435,2021-01-22,000001,Vente,300000,9006,,LE VILLAGE,B087,66210,66098,La Llagonne,66,,,660980000B1027,,,,,,,,,,,,,0,4,Local industriel. commercial ou assimilé,558,0,S,sols,,,1375,2.116857,42.528085
2021-1123680,2021-02-17,000002,Vente,30000,,,RUE DE LA VIEILLE ECOLE,0008,66210,66098,La Llagonne,66,,,660980000A1413,,,,,,,,,,,,,0,,,,,S,sols,,,111,2.121511,42.525558
2021-1124931,2021-04-12,000001,Vente,277100,5001,,LOT CAMBRE D AZE,A008,66210,66098,La Llagonne,66,,,660980000B0599,,,,,,,,,,,,,0,1,Maison,112,5,S,sols,,,528,2.119221,42.528079
2021-1125001,2021-04-29,000001,Vente,53000,9001,,RES ROSA DELS VENTS,A046,66210,66098,La Llagonne,66,,,660980000B0831,,,29,,,,,,,,,,1,3,Dépendance,,0,,,,,,2.11488,42.527011
2021-1125001,2021-04-29,000001,Vente,53000,9001,,RES ROSA DELS VENTS,A046,66210,66098,La Llagonne,66,,,660980000B0831,,,51,23.27,,,,,,,,,1,2,Appartement,25,1,,,,,,2.11488,42.527011
2021-1125155,2021-05-04,000001,Vente,140000,76,A,LE VILLAGE,B087,66210,66098,La Llagonne,66,,,660980000A0959,,,,,,,,,,,,,0,1,Maison,62,3,S,sols,,,95,2.1214,42.527104
2021-1125400,2021-05-12,000001,Vente,5000,,,LE VILLAGE,B087,66210,66098,La Llagonne,66,,,660980000A0498,,,,,,,,,,,,,0,,,,,S,sols,,,25,2.122758,42.526468
2021-1125531,2021-05-18,000001,Vente,30000,,,LE VILLAGE,B087,66210,66098,La Llagonne,66,,,660980000A0507,,,,,,,,,,,,,0,,,,,T,terres,,,90,2.12309,42.526256
2021-1125531,2021-05-18,000001,Vente,30000,158,,LE VILLAGE,B087,66210,66098,La Llagonne,66,,,660980000A0508,,,,,,,,,,,,,0,4,Local industriel. commercial ou assimilé,40,0,S,sols,,,55,2.123132,42.526166
2021-1126484,2021-06-24,000001,Vente,15000,,,LE VILLAGE,B087,66210,66098,La Llagonne,66,,,660980000A0595,,,,,,,,,,,,,0,,,,,S,sols,,,115,2.121195,42.525943
2021-1126484,2021-06-24,000001,Vente,15000,,,LE VILLAGE,B087,66210,66098,La Llagonne,66,,,660980000A1373,,,,,,,,,,,,,0,,,,,S,sols,,,112,2.12109,42.525982
2021-1127347,2021-07-19,000001,Vente,8000,,,LA CORTALASSE,B018,66210,66098,La Llagonne,66,,,660980000B0241,,,,,,,,,,,,,0,,,,,T,terres,,,4020,2.120118,42.521739
2021-1127347,2021-07-19,000001,Vente,8000,,,LA CORTALASSE,B018,66210,66098,La Llagonne,66,,,660980000B0242,,,,,,,,,,,,,0,,,,,T,terres,,,3780,2.120905,42.521853
2021-1128280,2021-08-24,000001,Vente,228100,15,,VOIE ROYALE,0034,66210,66098,La Llagonne,66,,,660980000B0859,,,,,,,,,,,,,0,1,Maison,89,4,S,sols,,,15,2.118253,42.524814
2021-1128280,2021-08-24,000001,Vente,228100,15,,VOIE ROYALE,0034,66210,66098,La Llagonne,66,,,660980000B0862,,,,,,,,,,,,,0,,,,,S,sols,,,509,2.118154,42.524789
2021-1128533,2021-09-28,000002,Vente,45000,5001,,PL DE L'ABBE HIGONET,0020,66210,66098,La Llagonne,66,,,660980000A1262,,,,,,,,,,,,,0,1,Maison,50,2,S,sols,,,60,2.121854,42.527237
2021-1128747,2021-10-08,000001,Vente,124740,4,,RUE CORADOU,1820,66210,66098,La Llagonne,66,,,660980000A0498,,,,,,,,,,,,,0,,,,,S,sols,,,25,2.122758,42.526468
2021-1128747,2021-10-08,000001,Vente,124740,150,,LE VILLAGE,B087,66210,66098,La Llagonne,66,,,660980000A1036,,,,,,,,,,,,,0,1,Maison,52,1,S,sols,,,38,2.122821,42.526473
2021-1129084,2021-10-22,000001,Vente,245000,6,,RUE DE LA FONTAINE,0012,66210,66098,La Llagonne,66,,,660980000A0541,,,,,,,,,,,,,0,1,Maison,100,5,S,sols,,,280,2.122068,42.526893
2021-1129084,2021-10-22,000001,Vente,245000,6,,RUE DE LA FONTAINE,0012,66210,66098,La Llagonne,66,,,660980000A0542,,,,,,,,,,,,,0,,,,,T,terres,,,260,2.122001,42.526963
2021-1129826,2021-11-26,000001,Vente,235000,3,A,LOT LO CORREC,A015,66210,66098,La Llagonne,66,,,660980000B0747,,,,,,,,,,,,,0,1,Maison,83,3,S,sols,,,465,2.120066,42.52863
2021-1130043,2021-11-25,000001,Vente,66000,,,LAS BASSES,B031,66210,66098,La Llagonne,66,,,660980000B0728,,,,,,,,,,,,,0,,,,,P,prés,,,1107,2.118834,42.528531
2021-1130043,2021-11-25,000001,Vente,66000,,,LAS BASSES,B031,66210,66098,La Llagonne,66,,,660980000B0732,,,,,,,,,,,,,0,,,,,P,prés,,,442,2.119431,42.52844
2021-1130269,2021-11-23,000001,Vente,190000,4,,RUE DES ESCARBESSES,0011,66210,66098,La Llagonne,66,,,660980000A0476,,,,,,,,,,,,,0,1,Maison,140,8,S,sols,,,310,2.122192,42.527359
2021-1130776,2021-12-16,000002,Vente,150,,,LAS BASSES,B031,66210,66098,La Llagonne,66,,,660980000B1032,,,,,,,,,,,,,0,,,,,L,landes,,,723,2.116442,42.528391
