id_mutation,date_mutation,numero_disposition,nature_mutation,valeur_fonciere,adresse_numero,adresse_suffixe,adresse_nom_voie,adresse_code_voie,code_postal,code_commune,nom_commune,code_departement,ancien_code_commune,ancien_nom_commune,id_parcelle,ancien_id_parcelle,numero_volume,lot1_numero,lot1_surface_carrez,lot2_numero,lot2_surface_carrez,lot3_numero,lot3_surface_carrez,lot4_numero,lot4_surface_carrez,lot5_numero,lot5_surface_carrez,nombre_lots,code_type_local,type_local,surface_reelle_bati,nombre_pieces_principales,code_nature_culture,nature_culture,code_nature_culture_speciale,nature_culture_speciale,surface_terrain,longitude,latitude
2021-1168046,2021-01-19,000001,Vente,245000,62,,ALL DE L ANCIENNE GARE,0005,69460,69145,Odenas,69,,,691450000C0497,,,,,,,,,,,,,0,1,Maison,93,5,S,sols,,,944,4.645283,46.088183
2021-1168785,2021-02-26,000001,Vente,43100,356,,RUE DU BEAUJOLAIS,0007,69460,69145,Odenas,69,,,691450000C0410,,,,,,,,,,,,,0,4,Local industriel. commercial ou assimilé,420,0,S,sols,,,423,4.645872,46.08664
2021-1169381,2021-04-14,000001,Vente,50000,247,,RUE DU BEAUJOLAIS,0007,69460,69145,Odenas,69,,,691450000C0376,,,,,,,,,,,,,0,1,Maison,72,3,S,sols,,,241,4.646952,46.087351
2021-1169602,2021-04-22,000001,Vente,103090.12,,,COTE DE BROUILLY,B013,69460,69145,Odenas,69,,,691450000A0673,,,,,,,,,,,,,0,,,,,VI,vignes,,,391,4.650348,46.10089
2021-1169602,2021-04-22,000001,Vente,103090.12,804,,RTE DU MONT BROUILLY,0082,69460,69145,Odenas,69,,,691450000A0675,,,,,,,,,,,,,0,1,Maison,41,2,S,sols,,,846,4.650224,46.101013
2021-1169715,2021-04-23,000001,Vente,508600,181,,RUE DU BEAUJOLAIS,0007,69460,69145,Odenas,69,,,691450000C0951,,,,,,,,,,,,,0,2,Appartement,52,2,AG,terrains d'agrément,PARC,Parc,1400,4.647146,46.088018
2021-1169715,2021-04-23,000001,Vente,508600,181,,RUE DU BEAUJOLAIS,0007,69460,69145,Odenas,69,,,691450000C0951,,,,,,,,,,,,,0,1,Maison,160,5,S,sols,,,727,4.647146,46.088018
2021-1169715,2021-04-23,000001,Vente,508600,181,,RUE DU BEAUJOLAIS,0007,69460,69145,Odenas,69,,,691450000C0951,,,,,,,,,,,,,0,3,Dépendance,,0,S,sols,,,727,4.647146,46.088018
2021-1169715,2021-04-23,000001,Vente,508600,181,,RUE DU BEAUJOLAIS,0007,69460,69145,Odenas,69,,,691450000C0951,,,,,,,,,,,,,0,2,Appartement,52,2,S,sols,,,727,4.647146,46.088018
2021-1169715,2021-04-23,000001,Vente,508600,181,,RUE DU BEAUJOLAIS,0007,69460,69145,Odenas,69,,,691450000C0951,,,,,,,,,,,,,0,3,Dépendance,,0,AG,terrains d'agrément,PARC,Parc,1400,4.647146,46.088018
2021-1169715,2021-04-23,000001,Vente,508600,181,,RUE DU BEAUJOLAIS,0007,69460,69145,Odenas,69,,,691450000C0951,,,,,,,,,,,,,0,1,Maison,160,5,AG,terrains d'agrément,PARC,Parc,1400,4.647146,46.088018
2021-1170183,2021-06-03,000001,Vente,18000,,,SABURIN,B031,69460,69145,Odenas,69,,,691450000D0036,,,,,,,,,,,,,0,,,,,L,landes,,,24700,4.627081,46.100064
2021-1170234,2021-06-03,000001,Vente,3800,,,LE MOULIN FAVRE,B023,69460,69145,Odenas,69,,,691450000D0232,,,,,,,,,,,,,0,,,,,BT,taillis simples,,,6290,4.63416,46.097443
2021-1170404,2021-06-17,000001,Vente,442300,158,,RUE DES FRAIRIES,0037,69460,69145,Odenas,69,,,691450000C0840,,,,,,,,,,,,,0,3,Dépendance,,0,S,sols,,,854,4.64368,46.091327
2021-1170404,2021-06-17,000001,Vente,442300,158,,RUE DES FRAIRIES,0037,69460,69145,Odenas,69,,,691450000C0840,,,,,,,,,,,,,0,1,Maison,166,6,S,sols,,,854,4.64368,46.091327
2021-1170582,2021-06-22,000001,Vente,204111,,,COTE DE BROUILLY,B013,69460,69145,Odenas,69,,,691450000A0319,,,,,,,,,,,,,0,,,,,VI,vignes,,,422,4.659896,46.100128
2021-1170582,2021-06-22,000001,Vente,204111,,,COTE DE BROUILLY,B013,69460,69145,Odenas,69,,,691450000A0320,,,,,,,,,,,,,0,,,,,VI,vignes,,,11458,4.659442,46.100163
2021-1170582,2021-06-22,000001,Vente,204111,,,COTE DE BROUILLY,B013,69460,69145,Odenas,69,,,691450000A0321,,,,,,,,,,,,,0,,,,,VI,vignes,,,2660,4.658813,46.100173
2021-1170582,2021-06-22,000001,Vente,204111,,,COTE DE BROUILLY,B013,69460,69145,Odenas,69,,,691450000A0438,,,,,,,,,,,,,0,,,,,VI,vignes,,,1600,4.65609,46.099159
2021-1170582,2021-06-22,000001,Vente,204111,,,COTE DE BROUILLY,B013,69460,69145,Odenas,69,,,691450000A0438,,,,,,,,,,,,,0,,,,,VI,vignes,,,2000,4.65609,46.099159
2021-1170582,2021-06-22,000001,Vente,204111,,,COTE DE BROUILLY,B013,69460,69145,Odenas,69,,,691450000A0438,,,,,,,,,,,,,0,,,,,T,terres,,,1746,4.65609,46.099159
2021-1170582,2021-06-22,000001,Vente,204111,,,PIERREUX,B025,69460,69145,Odenas,69,,,691450000B0102,,,,,,,,,,,,,0,,,,,T,terres,,,359,4.658214,46.098054
2021-1170582,2021-06-22,000001,Vente,204111,,,PIERREUX,B025,69460,69145,Odenas,69,,,691450000B0371,,,,,,,,,,,,,0,,,,,VI,vignes,,,1653,4.658599,46.097291
2021-1170582,2021-06-22,000001,Vente,204111,,,PIERREUX,B025,69460,69145,Odenas,69,,,691450000B0372,,,,,,,,,,,,,0,,,,,VI,vignes,,,6418,4.658336,46.097756
2021-1171095,2021-07-01,000001,Vente,9200,,,COTE DE BROUILLY,B013,69460,69145,Odenas,69,,,691450000A0227,,,,,,,,,,,,,0,,,,,VI,vignes,,,1474,4.657359,46.105227
2021-1171324,2021-07-28,000001,Vente,315000,104,,RUE DE LA JARDINIERE,0060,69460,69145,Odenas,69,,,691450000C0617,,,,,,,,,,,,,0,1,Maison,115,6,S,sols,,,812,4.644411,46.089054
2021-1171589,2021-07-29,000001,Vente,55000,,,LA COMMUNE,B012,69460,69145,Odenas,69,,,691450000C0742,,,,,,,,,,,,,0,,,,,VI,vignes,,,7941,4.641278,46.083052
2021-1172142,2021-09-08,000001,Vente,500,,,SABURIN,B031,69460,69145,Odenas,69,,,691450000D0038,,,,,,,,,,,,,0,,,,,L,landes,,,4710,4.625413,46.09965
2021-1172598,2021-09-28,000001,Vente,268000,1032,,RTE DU MONT BROUILLY,0082,69460,69145,Odenas,69,,,691450000A0150,,,,,,,,,,,,,0,1,Maison,86,3,S,sols,,,400,4.652201,46.100214
2021-1172724,2021-09-06,000001,Vente,230000,450,,RTE DE CHARENTAY,0009,69460,69145,Odenas,69,,,691450000C0692,,,,,,,,,,,,,0,1,Maison,69,3,S,sols,,,528,4.652439,46.087568
2021-1173379,2021-11-15,000001,Vente,290000,292,,RUE DU BEAUJOLAIS,0007,69460,69145,Odenas,69,,,691450000C1002,,,,,,,,,,,,,0,2,Appartement,107,5,S,sols,,,240,4.645996,46.087168
2021-1173950,2021-11-30,000001,Vente,270800,57,,RUE DE L EGLISE,0032,69460,69145,Odenas,69,,,691450000C0421,,,5,103.65,,,,,,,,,1,1,Maison,45,2,,,,,,4.645761,46.087278
2021-1173950,2021-11-30,000001,Vente,270800,57,,RUE DE L EGLISE,0032,69460,69145,Odenas,69,,,691450000C0421,,,5,103.65,,,,,,,,,1,3,Dépendance,,0,,,,,,4.645761,46.087278
2021-1173950,2021-11-30,000001,Vente,270800,57,,RUE DE L EGLISE,0032,69460,69145,Odenas,69,,,691450000C0421,,,5,103.65,,,,,,,,,1,3,Dépendance,,0,,,,,,4.645761,46.087278
2021-1173950,2021-11-30,000001,Vente,270800,57,,RUE DE L EGLISE,0032,69460,69145,Odenas,69,,,691450000C0421,,,5,103.65,,,,,,,,,1,3,Dépendance,,0,,,,,,4.645761,46.087278
2021-1173950,2021-11-30,000001,Vente,270800,57,,RUE DE L EGLISE,0032,69460,69145,Odenas,69,,,691450000C0421,,,5,103.65,,,,,,,,,1,3,Dépendance,,0,,,,,,4.645761,46.087278
2021-1173950,2021-11-30,000001,Vente,270800,57,,RUE DE L EGLISE,0032,69460,69145,Odenas,69,,,691450000C0421,,,5,103.65,,,,,,,,,1,1,Maison,83,4,,,,,,4.645761,46.087278
