id_mutation,date_mutation,numero_disposition,nature_mutation,valeur_fonciere,adresse_numero,adresse_suffixe,adresse_nom_voie,adresse_code_voie,code_postal,code_commune,nom_commune,code_departement,ancien_code_commune,ancien_nom_commune,id_parcelle,ancien_id_parcelle,numero_volume,lot1_numero,lot1_surface_carrez,lot2_numero,lot2_surface_carrez,lot3_numero,lot3_surface_carrez,lot4_numero,lot4_surface_carrez,lot5_numero,lot5_surface_carrez,nombre_lots,code_type_local,type_local,surface_reelle_bati,nombre_pieces_principales,code_nature_culture,nature_culture,code_nature_culture_speciale,nature_culture_speciale,surface_terrain,longitude,latitude
2021-1174285,2021-01-06,000001,Vente,5730,,,GRANDS VERGERS,B045,70400,70277,Granges-le-Bourg,70,,,702770000A0706,,,,,,,,,,,,,0,,,,,J,jardins,,,310,6.583863,47.565687
2021-1174285,2021-01-06,000001,Vente,5730,,,GRANDS VERGERS,B045,70400,70277,Granges-le-Bourg,70,,,702770000A2649,,,,,,,,,,,,,0,,,,,VE,vergers,,,639,6.583642,47.565954
2021-1174321,2021-01-19,000001,Vente,59000,,,PRES DU MOULIN VILLEMENOT,B066,70400,70277,Granges-le-Bourg,70,,,702770000A1048,,,,,,,,,,,,,0,,,,,P,prés,,,1980,6.57101,47.563034
2021-1174321,2021-01-19,000001,Vente,59000,,,PRES DU MOULIN VILLEMENOT,B066,70400,70277,Granges-le-Bourg,70,,,702770000A1049,,,,,,,,,,,,,0,,,,,P,prés,,,740,6.571795,47.56289
2021-1174321,2021-01-19,000001,Vente,59000,11,B,RUE DU HAMEAU DE GRANGES,0047,70400,70277,Granges-le-Bourg,70,,,702770000A1053,,,,,,,,,,,,,0,1,Maison,50,2,S,sols,,,501,6.57107,47.562761
2021-1174321,2021-01-19,000001,Vente,59000,11,B,RUE DU HAMEAU DE GRANGES,0047,70400,70277,Granges-le-Bourg,70,,,702770000A1053,,,,,,,,,,,,,0,1,Maison,89,3,S,sols,,,501,6.57107,47.562761
2021-1174321,2021-01-19,000001,Vente,59000,,,PRES DU MOULIN VILLEMENOT,B066,70400,70277,Granges-le-Bourg,70,,,702770000A1056,,,,,,,,,,,,,0,,,,,J,jardins,,,310,6.571117,47.562549
2021-1174321,2021-01-19,000001,Vente,59000,,,MOULIN VUILLEMENOT,B086,70400,70277,Granges-le-Bourg,70,,,70277000ZE0002,,,,,,,,,,,,,0,,,,,P,prés,,,250,6.570444,47.563944
2021-1174321,2021-01-19,000001,Vente,59000,,,MOULIN VUILLEMENOT,B086,70400,70277,Granges-le-Bourg,70,,,70277000ZE0003,,,,,,,,,,,,,0,,,,,P,prés,,,4460,6.570908,47.563587
2021-1175284,2021-03-24,000001,Vente,23000,,,LE VILLAGE,B081,70400,70277,Granges-le-Bourg,70,,,702770000A1415,,,,,,,,,,,,,0,,,,,S,sols,,,506,6.585787,47.564838
2021-1175284,2021-03-24,000001,Vente,23000,,,LE VILLAGE,B081,70400,70277,Granges-le-Bourg,70,,,702770000A1419,,,,,,,,,,,,,0,,,,,VE,vergers,,,855,6.586103,47.564857
2021-1175284,2021-03-24,000001,Vente,23000,,,LE VILLAGE,B081,70400,70277,Granges-le-Bourg,70,,,702770000A2250,,,,,,,,,,,,,0,,,,,J,jardins,,,225,6.585614,47.564718
2021-1175759,2021-04-14,000001,Vente,5500,,,CHAMPS MONTANTS,B017,70400,70277,Granges-le-Bourg,70,,,70277000ZA0071,,,,,,,,,,,,,0,,,,,P,prés,,,4660,6.584269,47.567533
2021-1175759,2021-04-14,000001,Vente,5500,,,EN LA JOURDAINE,B049,70400,70277,Granges-le-Bourg,70,,,70277000ZC0005,,,,,,,,,,,,,0,,,,,T,terres,,,8345,6.590203,47.566013
2021-1175759,2021-04-14,000001,Vente,5500,,,EN LA JOURDAINE,B049,70400,70277,Granges-le-Bourg,70,,,70277000ZC0005,,,,,,,,,,,,,0,,,,,T,terres,,,8345,6.590203,47.566013
2021-1176279,2021-05-19,000001,Vente,47800,3,,RUE SUR LES FOSSES,0042,70400,70277,Granges-le-Bourg,70,,,702770000A1424,,,,,,,,,,,,,0,1,Maison,98,4,S,sols,,,344,6.5857,47.565097
2021-1176279,2021-05-19,000001,Vente,47800,,,LE VILLAGE,B081,70400,70277,Granges-le-Bourg,70,,,702770000A2270,,,,,,,,,,,,,0,,,,,S,sols,,,107,6.58561,47.565035
2021-1177465,2021-07-12,000001,Vente,97140,4,,RUE NEUVE,0080,70400,70277,Granges-le-Bourg,70,,,702770000A1428,,,,,,,,,,,,,0,3,Dépendance,,0,S,sols,,,142,6.585555,47.565248
2021-1177465,2021-07-12,000001,Vente,97140,4,,RUE NEUVE,0080,70400,70277,Granges-le-Bourg,70,,,702770000A1428,,,,,,,,,,,,,0,3,Dépendance,,0,S,sols,,,142,6.585555,47.565248
2021-1177465,2021-07-12,000001,Vente,97140,4,,RUE NEUVE,0080,70400,70277,Granges-le-Bourg,70,,,702770000A1428,,,,,,,,,,,,,0,1,Maison,56,3,S,sols,,,142,6.585555,47.565248
2021-1177465,2021-07-12,000001,Vente,97140,,,LE VILLAGE,B081,70400,70277,Granges-le-Bourg,70,,,702770000A1429,,,,,,,,,,,,,0,,,,,S,sols,,,215,6.585461,47.5652
