id_mutation,date_mutation,numero_disposition,nature_mutation,valeur_fonciere,adresse_numero,adresse_suffixe,adresse_nom_voie,adresse_code_voie,code_postal,code_commune,nom_commune,code_departement,ancien_code_commune,ancien_nom_commune,id_parcelle,ancien_id_parcelle,numero_volume,lot1_numero,lot1_surface_carrez,lot2_numero,lot2_surface_carrez,lot3_numero,lot3_surface_carrez,lot4_numero,lot4_surface_carrez,lot5_numero,lot5_surface_carrez,nombre_lots,code_type_local,type_local,surface_reelle_bati,nombre_pieces_principales,code_nature_culture,nature_culture,code_nature_culture_speciale,nature_culture_speciale,surface_terrain,longitude,latitude
2021-1174724,2021-01-07,000001,Vente,70,,,LA PERNETTE,B035,70160,70472,Saint-Rémy-en-Comté,70,,,70472000ZB0060,,,,,,,,,,,,,0,,,,,BT,taillis simples,,,1690,6.100906,47.838692
2021-1175749,2021-04-16,000001,Vente,59000,1,,RUE JOSEPH BAVOUX,0017,70160,70472,Saint-Rémy-en-Comté,70,,,70472000AB0098,,,,,,,,,,,,,0,1,Maison,105,5,S,sols,,,427,6.09346,47.834687
2021-1175749,2021-04-16,000001,Vente,59000,1,,RUE JOSEPH BAVOUX,0017,70160,70472,Saint-Rémy-en-Comté,70,,,70472000AB0180,,,,,,,,,,,,,0,,,,,S,sols,,,3,6.093676,47.834584
2021-1175749,2021-04-16,000001,Vente,59000,,,VILLAGE DE SAINT REMY,B042,70160,70472,Saint-Rémy-en-Comté,70,,,70472000AB0181,,,,,,,,,,,,,0,,,,,S,sols,,,57,6.09365,47.834605
2021-1175749,2021-04-16,000001,Vente,59000,,,VILLAGE DE SAINT REMY,B042,70160,70472,Saint-Rémy-en-Comté,70,,,70472000AB0182,,,,,,,,,,,,,0,,,,,S,sols,,,90,6.093346,47.834674
2021-1175832,2021-04-16,000001,Vente,109100,,,VILLAGE DE SAINT REMY,B042,70160,70472,Saint-Rémy-en-Comté,70,,,70472000AB0040,,,,,,,,,,,,,0,,,,,J,jardins,,,150,6.094855,47.835942
2021-1175832,2021-04-16,000001,Vente,109100,,,VILLAGE DE SAINT REMY,B042,70160,70472,Saint-Rémy-en-Comté,70,,,70472000AB0041,,,,,,,,,,,,,0,,,,,J,jardins,,,55,6.094946,47.835915
2021-1175832,2021-04-16,000001,Vente,109100,,,VILLAGE DE SAINT REMY,B042,70160,70472,Saint-Rémy-en-Comté,70,,,70472000AB0042,,,,,,,,,,,,,0,,,,,J,jardins,,,135,6.094978,47.835968
2021-1175832,2021-04-16,000001,Vente,109100,,,VILLAGE DE SAINT REMY,B042,70160,70472,Saint-Rémy-en-Comté,70,,,70472000AB0043,,,,,,,,,,,,,0,,,,,S,sols,,,47,6.095013,47.835867
2021-1175832,2021-04-16,000001,Vente,109100,,,VILLAGE DE SAINT REMY,B042,70160,70472,Saint-Rémy-en-Comté,70,,,70472000AB0044,,,,,,,,,,,,,0,,,,,S,sols,,,27,6.095005,47.835811
2021-1175832,2021-04-16,000001,Vente,109100,,,VILLAGE DE SAINT REMY,B042,70160,70472,Saint-Rémy-en-Comté,70,,,70472000AB0045,,,,,,,,,,,,,0,,,,,S,sols,,,87,6.09509,47.835828
2021-1175832,2021-04-16,000001,Vente,109100,,,VILLAGE DE SAINT REMY,B042,70160,70472,Saint-Rémy-en-Comté,70,,,70472000AB0046,,,,,,,,,,,,,0,,,,,S,sols,,,45,6.095078,47.835743
2021-1175832,2021-04-16,000001,Vente,109100,4,,PL DE GRAPIGNY,0015,70160,70472,Saint-Rémy-en-Comté,70,,,70472000AB0047,,,,,,,,,,,,,0,1,Maison,154,7,S,sols,,,79,6.09516,47.835774
2021-1176528,2021-05-25,000001,Vente,138500,10,,RUE JUSTIN ET CLAUDE PERCHOT,0019,70160,70472,Saint-Rémy-en-Comté,70,,,70472000AA0003,,,,,,,,,,,,,0,1,Maison,131,6,S,sols,,,324,6.093283,47.833367
2021-1176528,2021-05-25,000001,Vente,138500,10,,RUE JUSTIN ET CLAUDE PERCHOT,0019,70160,70472,Saint-Rémy-en-Comté,70,,,70472000AA0003,,,,,,,,,,,,,0,1,Maison,131,6,P,prés,,,1201,6.093283,47.833367
2021-1176802,2021-06-30,000001,Vente,128950,6,,RUE DE LA VIGNE DU PUITS,0026,70160,70472,Saint-Rémy-en-Comté,70,,,70472000AB0253,,,,,,,,,,,,,0,1,Maison,92,5,S,sols,,,866,6.097061,47.835522
2021-1178034,2021-08-09,000001,Vente,120000,15,,RUE DE LA VIGNE DU PUITS,0026,70160,70472,Saint-Rémy-en-Comté,70,,,70472000AB0245,,,,,,,,,,,,,0,1,Maison,142,5,S,sols,,,858,6.096129,47.834166
2021-1178034,2021-08-09,000001,Vente,120000,15,,RUE DE LA VIGNE DU PUITS,0026,70160,70472,Saint-Rémy-en-Comté,70,,,70472000AB0245,,,,,,,,,,,,,0,3,Dépendance,,0,S,sols,,,858,6.096129,47.834166
2021-1178488,2021-09-14,000001,Vente,47500,14,,RUE DE LA VIGNE DU PUITS,0026,70160,70472,Saint-Rémy-en-Comté,70,,,70472000AB0310,,,,,,,,,,,,,0,,,,,S,sols,,,40,6.095992,47.83448
2021-1178488,2021-09-14,000001,Vente,47500,18,,RUE DE LA VIGNE DU PUITS,0026,70160,70472,Saint-Rémy-en-Comté,70,,,70472000AB0311,,,,,,,,,,,,,0,1,Maison,92,5,S,sols,,,620,6.095912,47.834561
