id_mutation,date_mutation,numero_disposition,nature_mutation,valeur_fonciere,adresse_numero,adresse_suffixe,adresse_nom_voie,adresse_code_voie,code_postal,code_commune,nom_commune,code_departement,ancien_code_commune,ancien_nom_commune,id_parcelle,ancien_id_parcelle,numero_volume,lot1_numero,lot1_surface_carrez,lot2_numero,lot2_surface_carrez,lot3_numero,lot3_surface_carrez,lot4_numero,lot4_surface_carrez,lot5_numero,lot5_surface_carrez,nombre_lots,code_type_local,type_local,surface_reelle_bati,nombre_pieces_principales,code_nature_culture,nature_culture,code_nature_culture_speciale,nature_culture_speciale,surface_terrain,longitude,latitude
2021-1174389,2021-01-29,000001,Vente,175500,,,LE VILLAGE,B048,70400,70484,Secenans,70,,,70484000ZA0112,,,,,,,,,,,,,0,,,,,BT,taillis simples,,,1816,6.574193,47.554011
2021-1174389,2021-01-29,000001,Vente,175500,6,A,RUE DES VIGNES,0080,70400,70484,Secenans,70,,,70484000ZA0115,,,,,,,,,,,,,0,1,Maison,117,3,J,jardins,,,2243,6.573688,47.553682
2021-1174389,2021-01-29,000001,Vente,175500,6,A,RUE DES VIGNES,0080,70400,70484,Secenans,70,,,70484000ZA0115,,,,,,,,,,,,,0,1,Maison,117,3,S,sols,,,1000,6.573688,47.553682
2021-1174439,2021-02-02,000001,Vente,279,,,CHAMPS DES OICHES,B008,70400,70484,Secenans,70,,,70484000ZA0026,,,,,,,,,,,,,0,,,,,T,terres,,,1116,6.569816,47.555401
2021-1174440,2021-02-02,000001,Vente,4960,,,CHAMPS DES OICHES,B008,70400,70484,Secenans,70,,,70484000ZA0027,,,,,,,,,,,,,0,,,,,T,terres,,,8532,6.568613,47.555139
2021-1174440,2021-02-02,000001,Vente,4960,,,CHAMPS DES OICHES,B008,70400,70484,Secenans,70,,,70484000ZA0028,,,,,,,,,,,,,0,,,,,T,terres,,,11303,6.568683,47.55481
2021-1175592,2021-04-06,000001,Vente,19000,,,PRES DE NARVOT,B035,70400,70484,Secenans,70,,,70484000ZC0015,,,,,,,,,,,,,0,,,,,BT,taillis simples,,,5518,6.56115,47.545299
2021-1175592,2021-04-06,000001,Vente,19000,,,PRES DE NARVOT,B035,70400,70484,Secenans,70,,,70484000ZC0016,,,,,,,,,,,,,0,,,,,BT,taillis simples,,,1157,6.56191,47.545738
2021-1175592,2021-04-06,000001,Vente,19000,,,PRES DE NARVOT,B035,70400,70484,Secenans,70,,,70484000ZC0017,,,,,,,,,,,,,0,,,,,T,terres,,,1976,6.561853,47.546104
2021-1175592,2021-04-06,000001,Vente,19000,,,EN L ETANG,B020,70400,70484,Secenans,70,,,70484000ZC0026,,,,,,,,,,,,,0,,,,,BT,taillis simples,,,2520,6.562735,47.546514
2021-1175592,2021-04-06,000001,Vente,19000,,,EN L ETANG,B020,70400,70484,Secenans,70,,,70484000ZC0027,,,,,,,,,,,,,0,,,,,BT,taillis simples,,,3355,6.562536,47.546107
2021-1175592,2021-04-06,000001,Vente,19000,,,SUR L ETANG,B021,70400,70484,Secenans,70,,,70484000ZC0033,,,,,,,,,,,,,0,,,,,BP,peupleraies,,,4348,6.565228,47.546072
2021-1175592,2021-04-06,000001,Vente,19000,,,EN NARVOT,B032,70400,70484,Secenans,70,,,70484000ZC0067,,,,,,,,,,,,,0,,,,,BT,taillis simples,,,646,6.557175,47.540577
2021-1175592,2021-04-06,000001,Vente,19000,,,EN NARVOT,B032,70400,70484,Secenans,70,,,70484000ZC0068,,,,,,,,,,,,,0,,,,,BT,taillis simples,,,389,6.558643,47.540422
2021-1175592,2021-04-06,000001,Vente,19000,,,SUR L ETANG,B021,70400,70484,Secenans,70,,,70484000ZC0095,,,,,,,,,,,,,0,,,,,BP,peupleraies,,,18234,6.564745,47.546677
2021-1176402,2021-06-02,000001,Vente,117000,1,A,RUE VOIE ROMAINE,0075,70400,70484,Secenans,70,,,704840000A1784,,,,,,,,,,,,,0,1,Maison,103,4,S,sols,,,601,6.570935,47.552682
2021-1177288,2021-07-12,000001,Vente,153000,,,SUR LE CRAIS,B014,70400,70484,Secenans,70,,,704840000A1019,,,,,,,,,,,,,0,,,,,VE,vergers,,,1961,6.573989,47.551968
2021-1177288,2021-07-12,000001,Vente,153000,4,,RUE DES BEAUMONTS,0005,70400,70484,Secenans,70,,,704840000A1020,,,,,,,,,,,,,0,1,Maison,96,3,S,sols,,,120,6.574176,47.551928
2021-1177499,2021-07-12,000001,Vente,1200,,,EN MAQUEY,B030,70400,70484,Secenans,70,,,70484000ZB0080,,,,,,,,,,,,,0,,,,,BT,taillis simples,,,1793,6.575947,47.546152
2021-1179670,2021-11-24,000001,Vente,187000,,,EN NARVOT,B032,70400,70484,Secenans,70,,,70484000ZC0088,,,,,,,,,,,,,0,,,,,BT,taillis simples,,,3239,6.557818,47.540022
2021-1179670,2021-11-24,000001,Vente,187000,,,EN NARVOT,B032,70400,70484,Secenans,70,,,70484000ZC0089,,,,,,,,,,,,,0,,,,,BT,taillis simples,,,17446,6.557024,47.540174
2021-1179671,2021-11-24,000001,Vente,65000,,,LES CROISOTTES,B016,70400,70484,Secenans,70,,,70484000ZA0075,,,,,,,,,,,,,0,,,,,T,terres,,,19980,6.565975,47.552299
2021-1179671,2021-11-24,000001,Vente,65000,,,LE VILLAGE,B048,70400,70484,Secenans,70,,,70484000ZB0044,,,,,,,,,,,,,0,,,,,T,terres,,,315,6.577945,47.552969
2021-1179671,2021-11-24,000001,Vente,65000,,,LE VILLAGE,B048,70400,70484,Secenans,70,,,70484000ZB0046,,,,,,,,,,,,,0,,,,,T,terres,,,5186,6.57905,47.5527
2021-1179671,2021-11-24,000001,Vente,65000,,,LE VILLAGE,B048,70400,70484,Secenans,70,,,70484000ZB0049,,,,,,,,,,,,,0,,,,,T,terres,,,1600,6.578558,47.552413
2021-1179671,2021-11-24,000001,Vente,65000,,,BOIS GUENEL,B002,70400,70484,Secenans,70,,,70484000ZC0003,,,,,,,,,,,,,0,,,,,T,terres,,,1777,6.55715,47.544423
2021-1179671,2021-11-24,000001,Vente,65000,,,AUX ROUTES,B041,70400,70484,Secenans,70,,,70484000ZC0018,,,,,,,,,,,,,0,,,,,T,terres,,,58648,6.559322,47.546208
2021-1179671,2021-11-24,000001,Vente,65000,,,AUX ROUTES,B041,70400,70484,Secenans,70,,,70484000ZC0018,,,,,,,,,,,,,0,,,,,T,terres,,,3525,6.559322,47.546208
2021-1179671,2021-11-24,000001,Vente,65000,,,AUX ROUTES,B041,70400,70484,Secenans,70,,,70484000ZC0018,,,,,,,,,,,,,0,,,,,T,terres,,,968,6.559322,47.546208
2021-1180384,2021-12-28,000001,Vente,159000,,,CHAMPS DE L AGE,B006,70400,70484,Secenans,70,,,704840000A0410,,,,,,,,,,,,,0,,,,,VE,vergers,,,320,6.570733,47.553402
2021-1180384,2021-12-28,000001,Vente,159000,14,,RUE DES VIGNES,0080,70400,70484,Secenans,70,,,704840000A0418,,,,,,,,,,,,,0,1,Maison,160,5,S,sols,,,920,6.570394,47.553505
2021-1180384,2021-12-28,000001,Vente,159000,,,CHAMPS DE L AGE,B006,70400,70484,Secenans,70,,,704840000A0419,,,,,,,,,,,,,0,,,,,T,terres,,,180,6.570342,47.55374
