id_mutation,date_mutation,numero_disposition,nature_mutation,valeur_fonciere,adresse_numero,adresse_suffixe,adresse_nom_voie,adresse_code_voie,code_postal,code_commune,nom_commune,code_departement,ancien_code_commune,ancien_nom_commune,id_parcelle,ancien_id_parcelle,numero_volume,lot1_numero,lot1_surface_carrez,lot2_numero,lot2_surface_carrez,lot3_numero,lot3_surface_carrez,lot4_numero,lot4_surface_carrez,lot5_numero,lot5_surface_carrez,nombre_lots,code_type_local,type_local,surface_reelle_bati,nombre_pieces_principales,code_nature_culture,nature_culture,code_nature_culture_speciale,nature_culture_speciale,surface_terrain,longitude,latitude
2021-1181329,2021-03-03,000001,Vente,140000,,,LE BOURG,B010,71250,71039,Blanot,71,,,71039000AB0072,,,,,,,,,,,,,0,,,,,J,jardins,,,230,4.733739,46.474173
2021-1181329,2021-03-03,000001,Vente,140000,5110,,LE BOURG,B010,71250,71039,Blanot,71,,,71039000AB0237,,,,,,,,,,,,,0,3,Dépendance,,0,S,sols,,,430,4.733316,46.474006
2021-1181329,2021-03-03,000001,Vente,140000,5110,,LE BOURG,B010,71250,71039,Blanot,71,,,71039000AB0237,,,,,,,,,,,,,0,4,Local industriel. commercial ou assimilé,150,0,S,sols,,,430,4.733316,46.474006
2021-1181329,2021-03-03,000001,Vente,140000,5110,,LE BOURG,B010,71250,71039,Blanot,71,,,71039000AB0237,,,,,,,,,,,,,0,1,Maison,65,2,S,sols,,,430,4.733316,46.474006
2021-1181329,2021-03-03,000001,Vente,140000,5110,,LE BOURG,B010,71250,71039,Blanot,71,,,71039000AB0237,,,,,,,,,,,,,0,4,Local industriel. commercial ou assimilé,203,0,S,sols,,,430,4.733316,46.474006
2021-1181329,2021-03-03,000001,Vente,140000,,,LE BOURG,B010,71250,71039,Blanot,71,,,71039000AB0313,,,,,,,,,,,,,0,,,,,T,terres,,,37,4.733409,46.473913
2021-1181846,2021-04-29,000002,Vente,500,,,LE BOURG,B010,71250,71039,Blanot,71,,,71039000AB0344,,,,,,,,,,,,,0,,,,,P,prés,,,85,4.734114,46.472323
2021-1182400,2021-06-29,000001,Vente,200,,,LE BOURG,B010,71250,71039,Blanot,71,,,71039000AB0140,,,,,,,,,,,,,0,,,,,J,jardins,,,64,4.733981,46.47339
2021-1182400,2021-06-29,000001,Vente,200,,,LE BOURG,B010,71250,71039,Blanot,71,,,71039000AB0141,,,,,,,,,,,,,0,,,,,J,jardins,,,137,4.733962,46.473473
2021-1182400,2021-06-29,000001,Vente,200,,,LA VINEUX,B255,71250,71039,Blanot,71,,,710390000F0120,,,,,,,,,,,,,0,,,,,BS,taillis sous futaie,,,76,4.729951,46.489798
2021-1182400,2021-06-29,000001,Vente,200,,,LA VINEUX,B255,71250,71039,Blanot,71,,,710390000F0121,,,,,,,,,,,,,0,,,,,BS,taillis sous futaie,,,1288,4.729264,46.489771
2021-1182816,2021-07-27,000001,Vente,13595,,,LES ROCHES,B209,71250,71039,Blanot,71,,,710390000A0197,,,,,,,,,,,,,0,,,,,P,prés,,,8857,4.737286,46.493589
2021-1182816,2021-07-27,000001,Vente,13595,,,MONT PELOUX,B143,71250,71039,Blanot,71,,,710390000A0244,,,,,,,,,,,,,0,,,,,P,prés,,,3375,4.736865,46.492159
2021-1182816,2021-07-27,000001,Vente,13595,,,MONT PELOUX,B143,71250,71039,Blanot,71,,,710390000A0245,,,,,,,,,,,,,0,,,,,BS,taillis sous futaie,,,15109,4.737349,46.491451
2021-1182816,2021-07-27,000001,Vente,13595,,,L ESSARD DE LA COMBE,B091,71250,71039,Blanot,71,,,710390000A0246,,,,,,,,,,,,,0,,,,,P,prés,,,260,4.737415,46.490328
2021-1183399,2021-09-30,000001,Vente,155000,,,A FOUGNIERES,B108,71250,71039,Blanot,71,,,710390000B0359,,,,,,,,,,,,,0,,,,,P,prés,,,90,4.744882,46.479077
2021-1183399,2021-09-30,000001,Vente,155000,5007,A,A FOUGNIERES,B108,71250,71039,Blanot,71,,,710390000B0361,,,,,,,,,,,,,0,1,Maison,81,4,S,sols,,,187,4.74501,46.479104
2021-1183399,2021-09-30,000001,Vente,155000,,,A FOUGNIERES,B108,71250,71039,Blanot,71,,,710390000B0362,,,,,,,,,,,,,0,,,,,S,sols,,,160,4.745123,46.479032
2021-1183399,2021-09-30,000001,Vente,155000,,,A FOUGNIERES,B108,71250,71039,Blanot,71,,,710390000B0504,,,,,,,,,,,,,0,,,,,S,sols,,,36,4.744908,46.479175
2021-1183643,2021-10-12,000001,Vente,40046,,,LES RIPPES,B198,71250,71039,Blanot,71,,,71039000AC0112,,,,,,,,,,,,,0,,,,,P,prés,,,3624,4.735272,46.49743
2021-1183643,2021-10-12,000001,Vente,40046,,,LES RIPPES,B198,71250,71039,Blanot,71,,,71039000AC0116,,,,,,,,,,,,,0,,,,,P,prés,,,2278,4.734984,46.497808
2021-1183643,2021-10-12,000001,Vente,40046,,,LES RIPPES,B198,71250,71039,Blanot,71,,,71039000AC0117,,,,,,,,,,,,,0,,,,,PA,pâtures,PATUR,Pâture plantée,2973,4.734415,46.497565
2021-1183643,2021-10-12,000001,Vente,40046,,,LES RIPPES,B198,71250,71039,Blanot,71,,,71039000AC0118,,,,,,,,,,,,,0,,,,,S,sols,,,7,4.734643,46.497928
2021-1183643,2021-10-12,000001,Vente,40046,,,LES RIPPES,B198,71250,71039,Blanot,71,,,71039000AC0119,,,,,,,,,,,,,0,,,,,P,prés,,,732,4.734786,46.498008
2021-1183643,2021-10-12,000001,Vente,40046,,,LES RIPPES,B198,71250,71039,Blanot,71,,,71039000AC0119,,,,,,,,,,,,,0,,,,,P,prés,,,733,4.734786,46.498008
2021-1183643,2021-10-12,000001,Vente,40046,,,LES RIPPES,B198,71250,71039,Blanot,71,,,71039000AC0120,,,,,,,,,,,,,0,,,,,P,prés,,,1624,4.734977,46.498283
2021-1183643,2021-10-12,000001,Vente,40046,,,LES RIPPES,B198,71250,71039,Blanot,71,,,71039000AC0120,,,,,,,,,,,,,0,,,,,P,prés,,,1624,4.734977,46.498283
2021-1183643,2021-10-12,000001,Vente,40046,,,LES RIPPES,B198,71250,71039,Blanot,71,,,71039000AC0121,,,,,,,,,,,,,0,,,,,T,terres,,,817,4.7347,46.498542
2021-1183643,2021-10-12,000001,Vente,40046,,,LES TILLES,B236,71250,71039,Blanot,71,,,710390000G0149,,,,,,,,,,,,,0,,,,,L,landes,FRICH,Friche,910,4.739553,46.502813
2021-1183643,2021-10-12,000001,Vente,40046,,,LES TILLES,B236,71250,71039,Blanot,71,,,710390000G0157,,,,,,,,,,,,,0,,,,,T,terres,,,2596,4.737803,46.502468
2021-1183643,2021-10-12,000001,Vente,40046,,,LES TILLES,B236,71250,71039,Blanot,71,,,710390000G0160,,,,,,,,,,,,,0,,,,,T,terres,,,665,4.737289,46.502119
2021-1183643,2021-10-12,000001,Vente,40046,,,LES TILLES,B236,71250,71039,Blanot,71,,,710390000G0161,,,,,,,,,,,,,0,,,,,T,terres,,,190,4.737187,46.501993
2021-1183643,2021-10-12,000001,Vente,40046,,,LES TILLES,B236,71250,71039,Blanot,71,,,710390000G0164,,,,,,,,,,,,,0,,,,,T,terres,,,5500,4.736677,46.501322
2021-1183643,2021-10-12,000001,Vente,40046,,,LES TILLES,B236,71250,71039,Blanot,71,,,710390000G0165,,,,,,,,,,,,,0,,,,,T,terres,,,5260,4.737259,46.50153
2021-1183643,2021-10-12,000001,Vente,40046,,,AU CLOU,B049,71250,71039,Blanot,71,,,710390000G0171,,,,,,,,,,,,,0,,,,,P,prés,,,1497,4.736589,46.499393
2021-1183643,2021-10-12,000001,Vente,40046,,,LES FRERIES,B113,71250,71039,Blanot,71,,,710390000G0200,,,,,,,,,,,,,0,,,,,PA,pâtures,PATUR,Pâture plantée,3950,4.734091,46.498444
2021-1183643,2021-10-12,000001,Vente,40046,,,TERRE A GAUDER,B227,71250,71039,Blanot,71,,,710390000G0212,,,,,,,,,,,,,0,,,,,PA,pâtures,PATUR,Pâture plantée,2985,4.734123,46.497104
2021-1183643,2021-10-12,000001,Vente,40046,,,TERRE A GAUDER,B227,71250,71039,Blanot,71,,,710390000G0213,,,,,,,,,,,,,0,,,,,BS,taillis sous futaie,,,2035,4.733745,46.496663
2021-1183643,2021-10-12,000001,Vente,40046,,,LES FRERIES,B113,71250,71039,Blanot,71,,,710390000G0263,,,,,,,,,,,,,0,,,,,PA,pâtures,PATUR,Pâture plantée,53,4.73335,46.497817
